program: Orca
programVersion: 5.0.2
elementType: O O C C C C C C C C C C C C C C C C C C H H H H H H H H H H H H H H H H H H H H H H H H H H
charge: 0
multiplicity: 1
keywords: wb97x-d3
keywords: def2-TZVPP
keywords: def2/J RIJCOSX
keywords: DEFGRID2
keywords: scfconv7
keywords: smallprint printgap noloewdin
keywords: NOSOSCF
formula: C18H26O2
InChI: InChI=1/C18H26O2/c1-8-10-13(5)15(9-2)20-17(19)16-14(11-12(3)4)18(16,6)7/h2,10-11,14-16H,8H2,1,3-7H3
46 atoms
O  -0.994918 -1.047065 -0.358186
O  -0.300498 0.277525 1.30833
C  1.933239 1.053419 -0.736826
C  2.483477 0.020065 0.196188
C  1.168729 -0.242893 -0.509069
C  1.431086 2.357373 -0.168604
C  2.562721 1.2080 -2.099938
C  3.652286 -0.818164 -0.160833
C  -0.086192 -0.282747 0.258004
C  4.867968 -0.741595 0.388033
C  5.249892 0.235089 1.456981
C  5.97108 -1.651407 -0.06125
C  -2.311542 -1.133027 0.223475
C  -3.156493 0.036404 -0.213167
C  -2.865238 -2.402105 -0.239026
C  -3.470194 0.138712 -1.676682
C  -3.590128 0.902084 0.702977
C  -4.445627 2.101958 0.423741
C  -3.35212 -3.436359 -0.606052
C  -5.135428 2.634392 1.671838
H  2.385928 0.273248 1.247658
H  1.209976 -0.942604 -1.336793
H  2.220207 3.108108 -0.239511
H  0.574478 2.730907 -0.732897
H  1.144537 2.290428 0.878094
H  3.459088 1.827616 -2.0316
H  2.850955 0.255571 -2.542721
H  1.872815 1.699381 -2.788037
H  3.495233 -1.552061 -0.946236
H  6.0637 0.877152 1.10993
H  4.432158 0.881778 1.770001
H  5.627094 -0.284159 2.341519
H  5.639334 -2.35156 -0.827771
H  6.80962 -1.078898 -0.466344
H  6.369175 -2.230481 0.775862
H  -2.238624 -1.158151 1.314022
H  -3.593482 1.174356 -1.990188
H  -2.682531 -0.295466 -2.292917
H  -4.394629 -0.388732 -1.924004
H  -3.306342 0.74009 1.73988
H  -5.194345 1.86124 -0.334807
H  -3.827557 2.894166 -0.012575
H  -3.775362 -4.364982 -0.919373
H  -4.409311 2.931909 2.429798
H  -5.744882 3.507268 1.438386
H  -5.789298 1.883001 2.116553
elementType: O C H
totalener: -851.99809023 hartree
nucrepener: 1527.27583567 hartree
electener: -2379.27392590 hartree
oneelecener: -4188.31418137 hartree
twoeener: 1809.04025547 hartree
cpcmener: -0.02488892 hartree
kineticenergy: 847.97849069 hartree
xcener: -85.214312435784 hartree
chargesum: 0.0000000
charge: -0.293040 -0.495563 0.149935 0.013544 -0.143830 -0.297459 -0.265459 -0.279219 0.428792 -0.034735 -0.252518 -0.227291 0.167781 -0.121997 -0.524935 -0.294692 -0.101914 -0.077023 0.200023 -0.273055 0.098222 0.091774 0.097091 0.102936 0.093336 0.096016 0.091026 0.098734 0.123720 0.096905 0.089469 0.097280 0.088947 0.094916 0.095026 0.125744 0.107107 0.104063 0.111953 0.112606 0.077323 0.081048 0.286556 0.083586 0.090324 0.086946
qa: -0.2930 -0.4956 0.1499 0.0135 -0.1438 -0.2975 -0.2655 -0.2792 0.4288 -0.0347 -0.2525 -0.2273 0.1678 -0.1220 -0.5249 -0.2947 -0.1019 -0.0770 0.2000 -0.2731 0.0982 0.0918 0.0971 0.1029 0.0933 0.0960 0.0910 0.0987 0.1237 0.0969 0.0895 0.0973 0.0889 0.0949 0.0950 0.1257 0.1071 0.1041 0.1120 0.1126 0.0773 0.0810 0.2866 0.0836 0.0903 0.0869
va: 2.1123 2.0113 3.6542 3.7716 3.9137 3.9012 3.9070 3.8733 4.1457 3.7141 3.9442 3.9242 3.8534 3.6507 3.9484 3.9465 3.8469 3.8988 3.4145 3.9529 1.0248 1.0398 1.0008 0.9982 1.0180 1.0028 1.0032 1.0025 1.0068 0.9968 1.0081 0.9977 1.0083 0.9958 0.9956 1.0238 0.9990 1.0140 0.9922 1.0133 1.0000 1.0016 0.9449 0.9981 1.0054 0.9997
dispcorr: -0.019744604 hartree
energy: -852.017834830193
dipole: 8.65940 -8.40043 0.25897 13.23043 -13.01578 0.21464 -1.99636 1.09679 -0.89958
magnitude: 0.96041 au
magnitude: 2.44116 debye
