program: Orca
programVersion: 5.0.2
elementType: O O C C C C C C C C C C C C C C C C C C H H H H H H H H H H H H H H H H H H H H H H H H H H
charge: 0
multiplicity: 1
keywords: wb97x-d3
keywords: def2-TZVPP
keywords: def2/J RIJCOSX
keywords: DEFGRID2
keywords: scfconv7
keywords: smallprint printgap noloewdin
keywords: NOSOSCF
formula: C18H26O2
InChI: InChI=1/C18H26O2/c1-8-10-13(5)15(9-2)20-17(19)16-14(11-12(3)4)18(16,6)7/h2,10-11,14-16H,8H2,1,3-7H3
46 atoms
O  -0.977431 -1.057203 -0.356233
O  -0.248891 0.2841 1.282206
C  1.893145 1.018804 -0.904119
C  2.507761 0.097327 0.105466
C  1.193154 -0.283251 -0.544268
C  1.349596 2.342784 -0.428453
C  2.472738 1.086965 -2.295866
C  3.709734 -0.708306 -0.19792
C  -0.052242 -0.298071 0.240643
C  4.861793 -0.702621 0.480307
C  5.13916 0.140737 1.6871
C  6.007841 -1.568319 0.050551
C  -2.28974 -1.124726 0.237922
C  -3.120581 0.068403 -0.164266
C  -2.872996 -2.373074 -0.244305
C  -3.440952 0.206659 -1.622309
C  -3.534933 0.914986 0.778237
C  -4.378926 2.134139 0.550233
C  -3.382748 -3.387056 -0.63552
C  -5.024374 2.642906 1.831339
H  2.416702 0.443938 1.12966
H  1.245806 -1.048305 -1.311167
H  2.12286 3.106779 -0.528256
H  0.496658 2.659234 -1.032181
H  1.040783 2.332031 0.614242
H  3.337478 1.753214 -2.31541
H  2.792871 0.115688 -2.670313
H  1.735154 1.483453 -2.995854
H  3.640164 -1.356413 -1.067022
H  4.285356 0.727678 2.020811
H  5.467239 -0.480342 2.52449
H  5.957432 0.836184 1.482828
H  6.891086 -0.964696 -0.173488
H  6.300269 -2.25545 0.848916
H  5.77027 -2.159788 -0.833263
H  -2.20497 -1.173323 1.327022
H  -4.298156 -0.410749 -1.902608
H  -3.677493 1.235497 -1.888618
H  -2.605667 -0.107724 -2.249691
H  -3.242438 0.720091 1.807154
H  -5.151951 1.926097 -0.193196
H  -3.759674 2.927966 0.119037
H  -3.831994 -4.290835 -0.98314
H  -5.673669 1.887905 2.277098
H  -4.271284 2.911495 2.573787
H  -5.629684 3.528803 1.640174
elementType: O C H
totalener: -851.99890932 hartree
nucrepener: 1527.83965055 hartree
electener: -2379.83855987 hartree
oneelecener: -4189.43550633 hartree
twoeener: 1809.59694646 hartree
cpcmener: -0.02528668 hartree
kineticenergy: 847.97428590 hartree
xcener: -85.214412972260 hartree
chargesum: 0.0000000
charge: -0.289223 -0.493411 0.121932 0.037738 -0.129482 -0.283944 -0.265946 -0.285048 0.423336 -0.045156 -0.252048 -0.221744 0.163063 -0.128557 -0.529225 -0.285406 -0.096376 -0.076065 0.200529 -0.274453 0.093807 0.091338 0.097988 0.100619 0.092180 0.097193 0.089108 0.098482 0.122795 0.090197 0.095580 0.097756 0.093714 0.094637 0.088975 0.127168 0.109360 0.103941 0.105511 0.112220 0.077246 0.081658 0.286844 0.087115 0.083797 0.090256
qa: -0.2892 -0.4934 0.1219 0.0377 -0.1295 -0.2839 -0.2659 -0.2850 0.4233 -0.0452 -0.2520 -0.2217 0.1631 -0.1286 -0.5292 -0.2854 -0.0964 -0.0761 0.2005 -0.2745 0.0938 0.0913 0.0980 0.1006 0.0922 0.0972 0.0891 0.0985 0.1228 0.0902 0.0956 0.0978 0.0937 0.0946 0.0890 0.1272 0.1094 0.1039 0.1055 0.1122 0.0772 0.0817 0.2868 0.0871 0.0838 0.0903
va: 2.1156 2.0142 3.6764 3.7723 3.8786 3.9036 3.9061 3.8641 4.1539 3.7464 3.9423 3.9213 3.8589 3.6621 3.9486 3.9437 3.8398 3.8965 3.4153 3.9522 1.0309 1.0390 1.0005 0.9988 1.0184 1.0024 1.0051 1.0022 1.0086 1.0094 0.9973 0.9969 0.9962 0.9961 1.0087 1.0218 0.9931 1.0016 1.0120 1.0130 1.0002 1.0009 0.9447 0.9996 0.9979 1.0054
dispcorr: -0.019605819 hartree
energy: -852.018515137171
dipole: 8.38517 -8.19944 0.18572 13.04087 -12.84794 0.19293 -1.66482 0.76400 -0.90082
magnitude: 0.93978 au
magnitude: 2.38874 debye
