program: Orca
programVersion: 5.0.2
elementType: O O C C C C C C C C C C C C C C C C C C H H H H H H H H H H H H H H H H H H H H H H H H H H
charge: 0
multiplicity: 1
keywords: wb97x-d3
keywords: def2-TZVPP
keywords: def2/J RIJCOSX
keywords: DEFGRID2
keywords: scfconv7
keywords: smallprint printgap noloewdin
keywords: NOSOSCF
formula: C18H26O2
InChI: InChI=1/C18H26O2/c1-8-10-13(5)15(9-2)20-17(19)16-14(11-12(3)4)18(16,6)7/h2,10-11,14-16H,8H2,1,3-7H3
46 atoms
O  -0.758712 -0.952377 -0.251614
O  -0.045946 -0.095513 1.688847
C  1.690032 1.609557 -0.353919
C  2.539551 0.634297 0.385055
C  1.279074 0.141716 -0.292702
C  0.92092 2.648268 0.424199
C  2.128401 2.092345 -1.714605
C  3.865506 0.189586 -0.11824
C  0.126943 -0.291552 0.508194
C  4.379524 -1.028645 0.069329
C  3.664138 -2.120248 0.8038
C  5.730592 -1.397616 -0.461411
C  -1.981057 -1.346109 0.367676
C  -2.953864 -0.194836 0.569291
C  -2.568208 -2.367724 -0.495484
C  -3.990403 -0.49553 1.606034
C  -2.842578 0.931429 -0.132557
C  -3.707304 2.148249 -0.04279
C  -3.084485 -3.207084 -1.181087
C  -4.364631 2.474774 -1.38058
H  2.454078 0.698203 1.467397
H  1.409957 -0.401567 -1.221682
H  1.514232 3.56177 0.495318
H  -0.015397 2.903541 -0.076855
H  0.68644 2.3371 1.440049
H  1.266913 2.428424 -2.294268
H  2.81167 2.938649 -1.619974
H  2.633304 1.318549 -2.292523
H  4.455523 0.92311 -0.660573
H  2.723896 -1.798894 1.24841
H  3.450154 -2.957649 0.134283
H  4.29273 -2.520525 1.602941
H  5.663972 -2.25803 -1.13223
H  6.195808 -0.578236 -1.009055
H  6.403855 -1.690408 0.348093
H  -1.772116 -1.803096 1.342131
H  -4.446311 -1.473361 1.434609
H  -3.539041 -0.531412 2.600693
H  -4.792296 0.238376 1.628512
H  -2.043358 1.012614 -0.864834
H  -3.080811 2.994471 0.256534
H  -4.471301 2.046229 0.728088
H  -3.539518 -3.950676 -1.797002
H  -5.033261 1.673926 -1.698408
H  -4.9505 3.391885 -1.313672
H  -3.61974 2.615146 -2.165367
elementType: O C H
totalener: -851.99737179 hartree
nucrepener: 1565.31136239 hartree
electener: -2417.30873418 hartree
oneelecener: -4264.22339874 hartree
twoeener: 1846.91466456 hartree
cpcmener: -0.02495809 hartree
kineticenergy: 847.97686092 hartree
xcener: -85.217161568512 hartree
chargesum: 0.0000000
charge: -0.295512 -0.487528 0.161370 -0.020661 -0.099826 -0.276910 -0.288732 -0.301996 0.378628 -0.011018 -0.243428 -0.229141 0.184698 -0.090779 -0.580845 -0.252651 -0.156540 -0.078214 0.239754 -0.264254 0.104554 0.095457 0.101792 0.095083 0.094392 0.098841 0.100632 0.093819 0.124669 0.079457 0.100563 0.101099 0.094889 0.089952 0.096441 0.126849 0.101803 0.105578 0.097748 0.122041 0.072616 0.069217 0.286557 0.083197 0.090882 0.085457
qa: -0.2955 -0.4875 0.1614 -0.0207 -0.0998 -0.2769 -0.2887 -0.3020 0.3786 -0.0110 -0.2434 -0.2291 0.1847 -0.0908 -0.5808 -0.2527 -0.1565 -0.0782 0.2398 -0.2643 0.1046 0.0955 0.1018 0.0951 0.0944 0.0988 0.1006 0.0938 0.1247 0.0795 0.1006 0.1011 0.0949 0.0900 0.0964 0.1268 0.1018 0.1056 0.0977 0.1220 0.0726 0.0692 0.2866 0.0832 0.0909 0.0855
va: 2.1056 2.0071 3.6942 3.8364 3.8086 3.8837 3.9056 3.8921 4.1600 3.7018 3.9363 3.9298 3.8244 3.7454 4.0567 3.9493 3.8434 3.9078 3.3622 3.9120 1.0252 1.0325 1.0028 1.0009 1.0162 1.0030 0.9993 1.0017 1.0028 1.0161 0.9980 0.9997 0.9963 1.0061 0.9961 1.0130 0.9973 0.9971 1.0069 1.0158 1.0062 1.0140 0.9453 1.0034 1.0049 1.0024
dispcorr: -0.021275277 hartree
energy: -852.018647062634
dipole: 4.19720 -4.11267 0.08453 10.46004 -10.33901 0.12103 -3.38735 2.60383 -0.78352
magnitude: 0.79731 au
magnitude: 2.02660 debye
