program: Orca
programVersion: 5.0.2
elementType: O O C C C C C C C C C C C C C C C C C C H H H H H H H H H H H H H H H H H H H H H H H H H H
charge: 0
multiplicity: 1
keywords: wb97x-d3
keywords: def2-TZVPP
keywords: def2/J RIJCOSX
keywords: DEFGRID2
keywords: scfconv7
keywords: smallprint printgap noloewdin
keywords: NOSOSCF
formula: C18H26O2
InChI: InChI=1/C18H26O2/c1-8-10-13(5)15(9-2)20-17(19)16-14(11-12(3)4)18(16,6)7/h2,10-11,14-16H,8H2,1,3-7H3
46 atoms
O  -1.092391 -1.333356 -0.298479
O  -0.454504 0.767947 -0.729096
C  2.177789 -0.80567 -1.54465
C  2.379389 -0.017538 -0.285402
C  1.187896 -0.942323 -0.396731
C  1.789168 -0.06626 -2.800986
C  3.044918 -2.011148 -1.812297
C  3.441492 -0.336077 0.693039
C  -0.170995 -0.382148 -0.491607
C  4.394712 0.497619 1.12148
C  4.563241 1.910429 0.653453
C  5.405946 0.051688 2.134086
C  -2.482573 -0.962283 -0.298277
C  -2.825636 -0.094486 0.894907
C  -2.887579 -0.452493 -1.604561
C  -2.408767 -0.700366 2.202142
C  -3.453519 1.071781 0.750423
C  -3.900278 2.009286 1.824191
C  -3.252302 -0.075568 -2.684385
C  -5.388542 2.324341 1.712072
H  2.132674 1.034512 -0.384196
H  1.252199 -1.880699 0.143528
H  2.68738 0.189171 -3.366067
H  1.163391 -0.688544 -3.443917
H  1.255655 0.861573 -2.6060
H  3.99713 -1.704649 -2.249826
H  3.261754 -2.583216 -0.911215
H  2.557817 -2.682604 -2.521446
H  3.433362 -1.344639 1.09651
H  3.82682 2.220055 -0.08522
H  4.508442 2.606392 1.494105
H  5.552229 2.045745 0.208276
H  6.419931 0.115946 1.730991
H  5.384768 0.696217 3.016674
H  5.237184 -0.9739 2.461378
H  -2.982646 -1.925771 -0.157399
H  -2.621711 -1.770854 2.225882
H  -1.336082 -0.586333 2.375539
H  -2.91945 -0.246046 3.048237
H  -3.687424 1.405158 -0.257225
H  -3.334639 2.941072 1.724428
H  -3.676095 1.622655 2.818614
H  -3.571928 0.254303 -3.647758
H  -5.629213 2.757578 0.740032
H  -5.993215 1.424929 1.833378
H  -5.696042 3.037904 2.476886
elementType: O C H
totalener: -851.99714899 hartree
nucrepener: 1543.72899817 hartree
electener: -2395.72614716 hartree
oneelecener: -4221.63459430 hartree
twoeener: 1825.90844714 hartree
cpcmener: -0.02902856 hartree
kineticenergy: 847.98627917 hartree
xcener: -85.220698754885 hartree
chargesum: 0.0000000
charge: -0.295053 -0.487853 0.120055 0.041800 -0.131929 -0.281337 -0.266576 -0.291233 0.427139 -0.040764 -0.253189 -0.222369 0.244892 -0.141196 -0.557259 -0.279857 -0.111265 -0.079365 0.168810 -0.260936 0.090084 0.092354 0.098192 0.099755 0.091847 0.097923 0.089637 0.099040 0.122924 0.090458 0.096727 0.096459 0.093899 0.094053 0.089803 0.131090 0.104495 0.106600 0.105338 0.119223 0.074875 0.066724 0.287664 0.085196 0.082324 0.090801
qa: -0.2951 -0.4879 0.1201 0.0418 -0.1319 -0.2813 -0.2666 -0.2912 0.4271 -0.0408 -0.2532 -0.2224 0.2449 -0.1412 -0.5573 -0.2799 -0.1113 -0.0794 0.1688 -0.2609 0.0901 0.0924 0.0982 0.0998 0.0918 0.0979 0.0896 0.0990 0.1229 0.0905 0.0967 0.0965 0.0939 0.0941 0.0898 0.1311 0.1045 0.1066 0.1053 0.1192 0.0749 0.0667 0.2877 0.0852 0.0823 0.0908
va: 2.1185 2.0197 3.6921 3.7589 3.8706 3.9077 3.9038 3.8676 4.1332 3.7416 3.9440 3.9213 3.9052 3.8033 3.9892 3.9584 3.7965 3.9258 3.4967 3.9152 1.0344 1.0385 1.0007 0.9996 1.0176 1.0022 1.0046 1.0023 1.0086 1.0089 0.9971 0.9972 0.9963 0.9959 1.0082 0.9816 1.0003 0.9958 1.0039 1.0118 1.0042 1.0142 0.9465 1.0028 1.0037 1.0050
dispcorr: -0.019982926 hartree
energy: -852.017131919887
dipole: 9.97575 -9.55982 0.41593 5.49924 -6.19303 -0.69378 7.96412 -7.46841 0.49571
magnitude: 0.94872 au
magnitude: 2.41144 debye
