program: Orca
programVersion: 5.0.2
elementType: O O C C C C C C C C C C C C C C C C C C H H H H H H H H H H H H H H H H H H H H H H H H H H
charge: 0
multiplicity: 1
keywords: wb97x-d3
keywords: def2-TZVPP
keywords: def2/J RIJCOSX
keywords: DEFGRID2
keywords: scfconv7
keywords: smallprint printgap noloewdin
keywords: NOSOSCF
formula: C18H26O2
InChI: InChI=1/C18H26O2/c1-8-10-13(5)15(9-2)20-17(19)16-14(11-12(3)4)18(16,6)7/h2,10-11,14-16H,8H2,1,3-7H3
46 atoms
O  -0.741232 -0.9127 -0.227233
O  -0.038467 -0.036279 1.707316
C  1.751143 1.62888 -0.305406
C  2.574072 0.621889 0.420902
C  1.30264 0.171401 -0.266457
C  1.004782 2.676597 0.482861
C  2.208523 2.118642 -1.65753
C  3.890884 0.158903 -0.089937
C  0.142619 -0.247648 0.530333
C  4.359637 -1.086976 0.017262
C  3.598849 -2.203694 0.662937
C  5.706044 -1.46243 -0.520919
C  -1.964047 -1.301535 0.395334
C  -2.939178 -0.149238 0.579765
C  -2.552484 -2.327811 -0.460924
C  -3.946505 -0.412242 1.654013
C  -2.868008 0.938605 -0.185013
C  -3.776741 2.126609 -0.151975
C  -3.07047 -3.173729 -1.137147
C  -4.683137 2.166961 -1.380369
H  2.488968 0.671525 1.504138
H  1.422654 -0.363825 -1.201455
H  0.069021 2.94746 -0.010565
H  0.773379 2.365943 1.499409
H  1.613044 3.58033 0.552284
H  2.915971 2.943174 -1.548326
H  2.693292 1.338853 -2.244571
H  1.359741 2.488148 -2.235614
H  4.517651 0.907001 -0.567484
H  3.37394 -2.987619 -0.065215
H  4.200777 -2.674903 1.443631
H  2.660377 -1.884921 1.112858
H  6.210751 -0.619582 -0.9925
H  6.35354 -1.84529 0.271756
H  5.62044 -2.262309 -1.261094
H  -1.755062 -1.748872 1.373928
H  -4.714384 0.355233 1.712236
H  -4.45125 -1.367865 1.492634
H  -3.459151 -0.477554 2.629968
H  -2.095748 0.989393 -0.947938
H  -3.165668 3.033178 -0.131609
H  -4.384989 2.145319 0.752614
H  -3.527855 -3.919114 -1.749141
H  -5.299012 3.067014 -1.383349
H  -4.102318 2.159932 -2.303813
H  -5.351173 1.305145 -1.402535
elementType: O C H
totalener: -851.99720666 hartree
nucrepener: 1563.65729948 hartree
electener: -2415.65450614 hartree
oneelecener: -4260.94409607 hartree
twoeener: 1845.28958993 hartree
cpcmener: -0.02485630 hartree
kineticenergy: 847.97928882 hartree
xcener: -85.217190869349 hartree
chargesum: 0.0000000
charge: -0.296395 -0.488895 0.155834 -0.013546 -0.103348 -0.278459 -0.287628 -0.303509 0.382657 -0.012950 -0.241808 -0.229226 0.188012 -0.091725 -0.581631 -0.250002 -0.149473 -0.089960 0.239046 -0.266626 0.104899 0.096228 0.096855 0.093430 0.100565 0.100392 0.094140 0.098631 0.124521 0.100278 0.101385 0.080903 0.089595 0.096756 0.095168 0.126650 0.096104 0.102201 0.104648 0.124658 0.074310 0.068315 0.286452 0.091496 0.086330 0.084725
qa: -0.2964 -0.4889 0.1558 -0.0135 -0.1033 -0.2785 -0.2876 -0.3035 0.3827 -0.0129 -0.2418 -0.2292 0.1880 -0.0917 -0.5816 -0.2500 -0.1495 -0.0900 0.2390 -0.2666 0.1049 0.0962 0.0969 0.0934 0.1006 0.1004 0.0941 0.0986 0.1245 0.1003 0.1014 0.0809 0.0896 0.0968 0.0952 0.1266 0.0961 0.1022 0.1046 0.1247 0.0743 0.0683 0.2865 0.0915 0.0863 0.0847
va: 2.1051 2.0086 3.6935 3.8261 3.8120 3.8875 3.9058 3.8916 4.1560 3.7039 3.9352 3.9299 3.8203 3.7257 4.0647 3.9509 3.8352 3.9179 3.3647 3.9085 1.0253 1.0317 1.0003 1.0166 1.0024 0.9996 1.0019 1.0030 1.0028 0.9983 0.9997 1.0144 1.0062 0.9962 0.9964 1.0142 1.0070 0.9964 0.9986 1.0159 1.0068 1.0102 0.9455 1.0053 1.0016 1.0018
dispcorr: -0.021218790 hartree
energy: -852.018425453937
dipole: 3.67492 -3.59911 0.07581 9.68561 -9.60637 0.07924 -3.71504 2.89056 -0.82448
magnitude: 0.83174 au
magnitude: 2.11412 debye
