program: Orca
programVersion: 5.0.2
elementType: O O C C C C C C C C C C C C C C C C C C H H H H H H H H H H H H H H H H H H H H H H H H H H
charge: 0
multiplicity: 1
keywords: wb97x-d3
keywords: def2-TZVPP
keywords: def2/J RIJCOSX
keywords: DEFGRID2
keywords: scfconv7
keywords: smallprint printgap noloewdin
keywords: NOSOSCF
formula: C18H26O2
InChI: InChI=1/C18H26O2/c1-8-10-13(5)15(9-2)20-17(19)16-14(11-12(3)4)18(16,6)7/h2,10-11,14-16H,8H2,1,3-7H3
46 atoms
O  -0.769078 -0.703244 0.489522
O  -0.843566 0.93902 2.002106
C  2.11954 -1.133816 1.386922
C  2.106138 -0.298556 0.142996
C  1.268635 0.123884 1.33819
C  1.500304 -2.510391 1.344146
C  3.317422 -1.065112 2.303776
C  3.249202 0.551185 -0.253079
C  -0.203108 0.168609 1.320667
C  3.900618 0.50653 -1.419694
C  3.584079 -0.438615 -2.537559
C  5.047775 1.431748 -1.693951
C  -2.203723 -0.683526 0.354639
C  -2.612542 0.337392 -0.672369
C  -2.586774 -2.034822 -0.043097
C  -2.114674 0.145628 -2.075766
C  -3.390068 1.357827 -0.31175
C  -3.868337 2.424252 -1.249891
C  -2.942765 -3.132776 -0.3729
C  -4.952681 3.305097 -0.648149
H  1.5424 -0.734801 -0.674211
H  1.67334 0.950306 1.912389
H  2.287128 -3.249298 1.181281
H  1.014804 -2.756395 2.290445
H  0.773566 -2.63604 0.545447
H  3.05424 -1.419585 3.301902
H  4.119853 -1.702631 1.927406
H  3.71566 -0.056565 2.40772
H  3.585006 1.273238 0.485646
H  2.737359 -1.091691 -2.33671
H  3.373045 0.110367 -3.458568
H  4.446703 -1.074606 -2.751855
H  4.851366 2.046281 -2.57646
H  5.249121 2.099464 -0.856587
H  5.961729 0.871418 -1.907239
H  -2.669348 -0.458924 1.317895
H  -1.626875 1.046632 -2.450878
H  -1.396029 -0.669218 -2.154945
H  -2.93472 -0.080116 -2.761125
H  -3.704221 1.435582 0.725923
H  -4.233901 1.966372 -2.174028
H  -3.019128 3.046438 -1.552994
H  -3.255467 -4.110897 -0.663878
H  -5.280371 4.063987 -1.358541
H  -5.828079 2.719605 -0.363655
H  -4.594374 3.820168 0.24428
elementType: O C H
totalener: -851.99593353 hartree
nucrepener: 1550.47139807 hartree
electener: -2402.46733160 hartree
oneelecener: -4234.42448985 hartree
twoeener: 1831.95715824 hartree
cpcmener: -0.02626214 hartree
kineticenergy: 847.98585570 hartree
xcener: -85.216603398366 hartree
chargesum: 0.0000000
charge: -0.279822 -0.496927 0.123087 0.060175 -0.141751 -0.278715 -0.271004 -0.300927 0.440465 -0.042005 -0.253777 -0.222831 0.141239 -0.099167 -0.527244 -0.301810 -0.112793 -0.077567 0.202129 -0.275630 0.102670 0.087826 0.094512 0.102589 0.086708 0.099174 0.096606 0.089455 0.123083 0.089229 0.095921 0.097412 0.094240 0.089345 0.093943 0.122956 0.113004 0.093696 0.116797 0.115294 0.076968 0.084046 0.286792 0.090496 0.086601 0.085515
qa: -0.2798 -0.4969 0.1231 0.0602 -0.1418 -0.2787 -0.2710 -0.3009 0.4405 -0.0420 -0.2538 -0.2228 0.1412 -0.0992 -0.5272 -0.3018 -0.1128 -0.0776 0.2021 -0.2756 0.1027 0.0878 0.0945 0.1026 0.0867 0.0992 0.0966 0.0895 0.1231 0.0892 0.0959 0.0974 0.0942 0.0893 0.0939 0.1230 0.1130 0.0937 0.1168 0.1153 0.0770 0.0840 0.2868 0.0905 0.0866 0.0855
va: 2.1156 2.0077 3.6713 3.7371 3.9018 3.9106 3.9138 3.8521 4.1405 3.7498 3.9459 3.9221 3.8978 3.6222 3.8980 3.9548 3.8523 3.8858 3.4085 3.9589 1.0141 1.0356 1.0006 0.9993 1.0106 1.0015 1.0022 1.0054 1.0093 1.0096 0.9972 0.9970 0.9961 1.0085 0.9962 1.0254 0.9941 1.0133 0.9949 1.0113 1.0004 1.0021 0.9451 1.0053 0.9991 0.9971
dispcorr: -0.020390849 hartree
energy: -852.016324380479
dipole: 9.32056 -8.70789 0.61267 5.26787 -5.90658 -0.63872 -10.13937 8.91315 -1.22622
magnitude: 1.51226 au
magnitude: 3.84387 debye
