program: Orca
programVersion: 5.0.2
elementType: O O C C C C C C C C C C C C C C C C C C H H H H H H H H H H H H H H H H H H H H H H H H H H
charge: 0
multiplicity: 1
keywords: wb97x-d3
keywords: def2-TZVPP
keywords: def2/J RIJCOSX
keywords: DEFGRID2
keywords: scfconv7
keywords: smallprint printgap noloewdin
keywords: NOSOSCF
formula: C18H26O2
InChI: InChI=1/C18H26O2/c1-8-10-13(5)15(9-2)20-17(19)16-14(11-12(3)4)18(16,6)7/h2,10-11,14-16H,8H2,1,3-7H3
46 atoms
O  -0.762687 0.209265 0.174617
O  0.275305 -0.566464 2.000434
C  2.45659 1.538679 0.966075
C  2.893063 0.128908 0.765367
C  1.520769 0.548999 0.28273
C  2.164451 2.023596 2.363455
C  3.009066 2.614527 0.063045
C  3.940372 -0.248959 -0.218479
C  0.319818 0.006711 0.935589
C  3.902245 -1.334752 -0.995022
C  2.769694 -2.314802 -0.989337
C  5.008728 -1.650743 -1.95385
C  -2.021447 -0.343947 0.607358
C  -3.100113 0.507648 -0.02423
C  -2.047802 -1.76074 0.25903
C  -3.211798 1.863315 0.60491
C  -3.840406 0.05246 -1.035305
C  -4.941276 0.759751 -1.755978
C  -2.044118 -2.927456 -0.024393
C  -6.26023 -0.000248 -1.648089
H  2.869009 -0.476631 1.668775
H  1.411804 0.70074 -0.785196
H  1.404498 2.807137 2.355136
H  1.826225 1.232715 3.029995
H  3.069963 2.450093 2.798876
H  2.319845 3.458992 0.009002
H  3.959568 2.989473 0.447698
H  3.177641 2.260366 -0.953938
H  4.806047 0.404927 -0.282126
H  3.147627 -3.335214 -0.89158
H  2.053806 -2.147475 -0.186863
H  2.22508 -2.278959 -1.936771
H  4.627446 -1.736177 -2.974661
H  5.789614 -0.890706 -1.946805
H  5.469182 -2.612997 -1.716636
H  -2.103201 -0.253347 1.69545
H  -3.997522 2.470097 0.161739
H  -3.424363 1.773144 1.672877
H  -2.278516 2.42316 0.517529
H  -3.657187 -0.959404 -1.387716
H  -4.66651 0.839249 -2.812169
H  -5.072918 1.780229 -1.396314
H  -2.040544 -3.963688 -0.280558
H  -7.046402 0.501827 -2.212484
H  -6.16722 -1.013905 -2.040998
H  -6.589587 -0.075017 -0.611162
elementType: O C H
totalener: -851.99785279 hartree
nucrepener: 1540.16207073 hartree
electener: -2392.15992352 hartree
oneelecener: -4214.03261807 hartree
twoeener: 1821.87269455 hartree
cpcmener: -0.02534707 hartree
kineticenergy: 847.97922428 hartree
xcener: -85.215686939276 hartree
chargesum: 0.0000000
charge: -0.284577 -0.496267 0.147387 -0.009458 -0.116907 -0.276299 -0.284126 -0.304460 0.418385 -0.013324 -0.237925 -0.229962 0.121300 -0.160161 -0.488602 -0.249993 -0.067188 -0.080230 0.164820 -0.260534 0.101593 0.096868 0.100426 0.089952 0.097662 0.098374 0.099430 0.093821 0.124331 0.101560 0.077939 0.101692 0.094636 0.090151 0.097352 0.131736 0.099203 0.101057 0.099810 0.122010 0.074080 0.068196 0.286052 0.091456 0.085172 0.083562
qa: -0.2846 -0.4963 0.1474 -0.0095 -0.1169 -0.2763 -0.2841 -0.3045 0.4184 -0.0133 -0.2379 -0.2300 0.1213 -0.1602 -0.4886 -0.2500 -0.0672 -0.0802 0.1648 -0.2605 0.1016 0.0969 0.1004 0.0900 0.0977 0.0984 0.0994 0.0938 0.1243 0.1016 0.0779 0.1017 0.0946 0.0902 0.0974 0.1317 0.0992 0.1011 0.0998 0.1220 0.0741 0.0682 0.2861 0.0915 0.0852 0.0836
va: 2.1049 2.0038 3.7044 3.8094 3.8285 3.8954 3.9062 3.8922 4.1132 3.7071 3.9359 3.9310 3.8333 3.8197 3.9454 3.9376 3.7491 3.9284 3.5100 3.9097 1.0279 1.0304 0.9997 1.0164 1.0009 1.0031 0.9999 1.0020 1.0034 1.0004 1.0151 0.9982 0.9963 1.0059 0.9961 1.0096 1.0079 0.9986 1.0044 1.0124 1.0033 1.0148 0.9468 1.0047 1.0030 1.0039
dispcorr: -0.020187538 hartree
energy: -852.018040326885
dipole: 1.07814 -1.24433 -0.16619 6.46402 -5.76248 0.70154 -7.98152 6.85606 -1.12546
magnitude: 1.33658 au
magnitude: 3.39732 debye
