program: Orca
programVersion: 5.0.2
elementType: O O C C C C C C C C C C C C C C C C C C H H H H H H H H H H H H H H H H H H H H H H H H H H
charge: 0
multiplicity: 1
keywords: wb97x-d3
keywords: def2-TZVPP
keywords: def2/J RIJCOSX
keywords: DEFGRID2
keywords: scfconv7
keywords: smallprint printgap noloewdin
keywords: NOSOSCF
formula: C18H26O2
InChI: InChI=1/C18H26O2/c1-8-10-13(5)15(9-2)20-17(19)16-14(11-12(3)4)18(16,6)7/h2,10-11,14-16H,8H2,1,3-7H3
46 atoms
O  -0.863116 -1.061113 -0.346269
O  -0.17468 -0.031944 1.516923
C  1.58949 1.554495 -0.561548
C  2.42581 0.56396 0.171061
C  1.132881 0.102911 -0.4859
C  0.874217 2.625607 0.224544
C  2.007934 2.017316 -1.936039
C  3.729154 0.069681 -0.331152
C  -0.001465 -0.30666 0.351377
C  4.419032 -0.935393 0.215777
C  3.938819 -1.72081 1.398326
C  5.753916 -1.347315 -0.323545
C  -2.062416 -1.450513 0.322541
C  -3.060227 -0.311603 0.473472
C  -2.641286 -2.535887 -0.463665
C  -3.977545 -0.497429 1.639843
C  -3.071064 0.699145 -0.39384
C  -3.964985 1.897701 -0.388955
C  -3.15319 -3.426958 -1.084934
C  -3.16769 3.188618 -0.22298
H  2.349156 0.635693 1.252056
H  1.233683 -0.450669 -1.412133
H  -0.076685 2.888419 -0.243506
H  0.677755 2.343109 1.256313
H  1.488954 3.527423 0.248104
H  2.744618 2.819881 -1.863455
H  2.440019 1.22003 -2.539863
H  1.146791 2.409014 -2.480049
H  4.154676 0.576555 -1.191834
H  2.889623 -1.546395 1.634588
H  4.068022 -2.791958 1.225512
H  4.52679 -1.479816 2.288605
H  5.733951 -2.385649 -0.6645
H  6.071786 -0.723348 -1.158638
H  6.52353 -1.293196 0.45091
H  -1.819289 -1.842658 1.316493
H  -3.413527 -0.473338 2.575601
H  -4.753177 0.26248 1.695212
H  -4.473208 -1.470532 1.598092
H  -2.33975 0.69828 -1.198407
H  -4.725786 1.833208 0.389158
H  -4.501248 1.935884 -1.342025
H  -3.614201 -4.210127 -1.645186
H  -2.414236 3.292064 -1.00566
H  -3.820619 4.060351 -0.276176
H  -2.6539 3.214385 0.738658
elementType: O C H
totalener: -851.99738797 hartree
nucrepener: 1566.53610823 hartree
electener: -2418.53349620 hartree
oneelecener: -4266.75475195 hartree
twoeener: 1848.22125575 hartree
cpcmener: -0.02503558 hartree
kineticenergy: 847.97427050 hartree
xcener: -85.216887266230 hartree
chargesum: 0.0000000
charge: -0.295507 -0.491958 0.161663 -0.052345 -0.060490 -0.276020 -0.297893 -0.274009 0.377164 -0.014364 -0.258035 -0.228987 0.177087 -0.100978 -0.570470 -0.243518 -0.151779 -0.072683 0.240483 -0.286390 0.101708 0.093268 0.094097 0.095194 0.101818 0.103897 0.090264 0.100505 0.126842 0.083112 0.094895 0.103139 0.095165 0.088989 0.094574 0.127187 0.102182 0.095583 0.103937 0.121118 0.068054 0.072452 0.286295 0.088864 0.099702 0.086190
qa: -0.2955 -0.4920 0.1617 -0.0523 -0.0605 -0.2760 -0.2979 -0.2740 0.3772 -0.0144 -0.2580 -0.2290 0.1771 -0.1010 -0.5705 -0.2435 -0.1518 -0.0727 0.2405 -0.2864 0.1017 0.0933 0.0941 0.0952 0.1018 0.1039 0.0903 0.1005 0.1268 0.0831 0.0949 0.1031 0.0952 0.0890 0.0946 0.1272 0.1022 0.0956 0.1039 0.1211 0.0681 0.0725 0.2863 0.0889 0.0997 0.0862
va: 2.1114 2.0048 3.7198 3.8472 3.8077 3.8754 3.9169 3.8842 4.1619 3.7064 3.9459 3.9285 3.8336 3.7352 4.0574 3.9436 3.8329 3.8977 3.3612 3.9189 1.0217 1.0346 1.0032 1.0171 1.0035 0.9985 1.0018 1.0016 1.0038 1.0126 0.9990 0.9967 0.9963 1.0074 0.9949 1.0135 0.9993 1.0094 0.9958 1.0201 1.0161 1.0043 0.9455 0.9982 1.0068 1.0012
dispcorr: -0.021308532 hartree
energy: -852.018696502289
dipole: 6.95353 -6.84090 0.11263 12.41218 -12.28139 0.13080 -0.45648 -0.25770 -0.71418
magnitude: 0.73474 au
magnitude: 1.86756 debye
