program: Orca
programVersion: 5.0.2
elementType: O O C C C C C C C C C C C C C C C C C C H H H H H H H H H H H H H H H H H H H H H H H H H H
charge: 0
multiplicity: 1
keywords: wb97x-d3
keywords: def2-TZVPP
keywords: def2/J RIJCOSX
keywords: DEFGRID2
keywords: scfconv7
keywords: smallprint printgap noloewdin
keywords: NOSOSCF
formula: C18H26O2
InChI: InChI=1/C18H26O2/c1-8-10-13(5)15(9-2)20-17(19)16-14(11-12(3)4)18(16,6)7/h2,10-11,14-16H,8H2,1,3-7H3
46 atoms
O  -0.742226 0.141859 -0.103393
O  0.290969 0.09364 1.877572
C  2.422253 1.735247 0.126561
C  2.909582 0.380692 0.509394
C  1.541416 0.517175 -0.12315
C  2.066285 2.720169 1.211439
C  2.969888 2.390331 -1.117473
C  4.001987 -0.316063 -0.21872
C  0.339141 0.238057 0.676928
C  4.058529 -1.634611 -0.424984
C  2.996051 -2.587631 0.02926
C  5.211778 -2.264181 -1.143762
C  -1.989946 -0.218104 0.514667
C  -3.097579 0.161729 -0.436432
C  -1.982211 -1.652782 0.802642
C  -3.079446 -0.494021 -1.78154
C  -4.018992 1.022284 0.001074
C  -5.237399 1.497822 -0.720509
C  -1.996747 -2.832408 1.027589
C  -6.498895 0.833104 -0.173365
H  2.873585 0.181805 1.578099
H  1.457233 0.229261 -1.165073
H  1.278057 3.399191 0.881413
H  1.737191 2.243093 2.132794
H  2.940317 3.326936 1.456047
H  2.255544 3.113667 -1.514576
H  3.893712 2.927926 -0.89447
H  3.18505 1.671489 -1.908137
H  4.821394 0.300249 -0.578679
H  2.516937 -3.0669 -0.828639
H  3.432371 -3.393055 0.624921
H  2.217301 -2.117522 0.627113
H  5.943886 -1.526814 -1.472304
H  5.72316 -2.987482 -0.50363
H  4.870402 -2.817909 -2.022044
H  -2.113551 0.33154 1.451013
H  -3.181748 -1.577704 -1.690041
H  -3.885217 -0.144181 -2.422291
H  -2.140686 -0.30974 -2.306866
H  -3.913951 1.401244 1.014674
H  -5.165259 1.320577 -1.79379
H  -5.319846 2.579688 -0.589256
H  -2.001842 -3.88142 1.224155
H  -6.480619 -0.243589 -0.34544
H  -6.601122 0.995544 0.900533
H  -7.39095 1.234121 -0.655641
elementType: O C H
totalener: -851.99867711 hartree
nucrepener: 1536.45516061 hartree
electener: -2388.45383773 hartree
oneelecener: -4206.64456325 hartree
twoeener: 1818.19072552 hartree
cpcmener: -0.02545838 hartree
kineticenergy: 847.98784472 hartree
xcener: -85.216826109790 hartree
chargesum: -0.0000000
charge: -0.291987 -0.496750 0.149755 -0.017070 -0.117509 -0.274354 -0.286552 -0.299236 0.414297 -0.016980 -0.238370 -0.229751 0.218416 -0.153484 -0.518718 -0.260759 -0.083549 -0.086749 0.132947 -0.266418 0.101436 0.098026 0.100886 0.090483 0.097426 0.098849 0.100221 0.093680 0.125332 0.100495 0.101258 0.077241 0.089928 0.096822 0.095060 0.119545 0.102105 0.101773 0.104790 0.126334 0.071833 0.075881 0.287911 0.086345 0.086996 0.092164
qa: -0.2920 -0.4967 0.1498 -0.0171 -0.1175 -0.2744 -0.2866 -0.2992 0.4143 -0.0170 -0.2384 -0.2298 0.2184 -0.1535 -0.5187 -0.2608 -0.0835 -0.0867 0.1329 -0.2664 0.1014 0.0980 0.1009 0.0905 0.0974 0.0988 0.1002 0.0937 0.1253 0.1005 0.1013 0.0772 0.0899 0.0968 0.0951 0.1195 0.1021 0.1018 0.1048 0.1263 0.0718 0.0759 0.2879 0.0863 0.0870 0.0922
va: 2.1327 1.9993 3.7053 3.8132 3.8277 3.8947 3.9075 3.8888 4.1336 3.7092 3.9358 3.9298 3.7981 3.8185 3.8366 3.9468 3.7989 3.9196 3.5647 3.9133 1.0285 1.0268 0.9994 1.0156 1.0009 1.0029 0.9995 1.0015 1.0029 0.9982 1.0002 1.0168 1.0062 0.9960 0.9965 1.0300 0.9961 1.0071 1.0057 1.0064 1.0100 1.0044 0.9459 1.0013 1.0014 1.0049
dispcorr: -0.020106254 hartree
energy: -852.018783367739
dipole: 0.78489 -1.02228 -0.23739 2.91266 -2.70797 0.20470 -8.64068 7.36702 -1.27367
magnitude: 1.31167 au
magnitude: 3.33400 debye
