program: Orca
programVersion: 5.0.2
elementType: O O C C C C C C C C C C C C C C C C C C H H H H H H H H H H H H H H H H H H H H H H H H H H
charge: 0
multiplicity: 1
keywords: wb97x-d3
keywords: def2-TZVPP
keywords: def2/J RIJCOSX
keywords: DEFGRID2
keywords: scfconv7
keywords: smallprint printgap noloewdin
keywords: NOSOSCF
formula: C18H26O2
InChI: InChI=1/C18H26O2/c1-8-10-13(5)15(9-2)20-17(19)16-14(11-12(3)4)18(16,6)7/h2,10-11,14-16H,8H2,1,3-7H3
46 atoms
O  -0.889898 -1.026868 -0.363325
O  -0.095137 -0.178826 1.546856
C  1.60846 1.514889 -0.513792
C  2.451467 0.493028 0.17286
C  1.149743 0.06323 -0.484044
C  0.907808 2.55722 0.323083
C  2.010896 2.031028 -1.874425
C  3.750071 0.019488 -0.357101
C  0.026475 -0.370442 0.361408
C  4.523282 -0.905527 0.219951
C  4.158874 -1.631767 1.479336
C  5.848731 -1.284273 -0.367066
C  -2.077844 -1.43029 0.313265
C  -3.040644 -0.28371 0.568232
C  -2.705108 -2.450309 -0.523261
C  -4.007835 -0.554892 1.67579
C  -2.991036 0.840265 -0.142463
C  -3.880134 2.038544 0.045621
C  -3.256361 -3.286872 -1.184317
C  -3.6852 3.078741 -1.047841
H  2.384841 0.528116 1.255905
H  1.229562 -0.457223 -1.431774
H  -0.027864 2.872025 -0.144093
H  0.682452 2.220414 1.33268
H  1.542412 3.441465 0.411123
H  2.753755 2.82637 -1.783148
H  2.428226 1.257062 -2.51798
H  1.144519 2.448423 -2.391099
H  4.10344 0.475671 -1.276852
H  4.326382 -2.705214 1.365896
H  4.790313 -1.310194 2.311925
H  3.121206 -1.491719 1.777097
H  5.871633 -2.344437 -0.633643
H  6.085813 -0.707429 -1.261235
H  6.655857 -1.131917 0.354848
H  -1.818179 -1.890816 1.273997
H  -3.494098 -0.560281 2.641111
H  -4.802527 0.186769 1.726786
H  -4.478455 -1.535057 1.566086
H  -2.24042 0.933504 -0.922941
H  -3.680358 2.497982 1.018725
H  -4.92998 1.733439 0.074761
H  -3.745672 -4.025603 -1.779095
H  -3.909971 2.667937 -2.033652
H  -4.335721 3.940043 -0.893267
H  -2.656539 3.443815 -1.069789
elementType: O C H
totalener: -852.00927624 hartree
nucrepener: 1556.84417656 hartree
electener: -2408.85345280 hartree
oneelecener: -4247.19757689 hartree
twoeener: 1838.34412409 hartree
cpcmener: -0.02100345 hartree
kineticenergy: 847.96386999 hartree
xcener: -85.213120117871 hartree
chargesum: 0.0000000
charge: -0.290612 -0.461789 0.144359 -0.052880 -0.043890 -0.264183 -0.297294 -0.258166 0.352128 -0.018175 -0.260343 -0.229796 0.170817 -0.082282 -0.563711 -0.254809 -0.149504 -0.079380 0.237466 -0.274922 0.100729 0.092546 0.088828 0.095241 0.099848 0.104328 0.088382 0.098965 0.120738 0.093416 0.101248 0.084449 0.094163 0.087389 0.093523 0.124104 0.105510 0.091925 0.101980 0.107874 0.083648 0.076800 0.282260 0.087804 0.090934 0.080336
qa: -0.2906 -0.4618 0.1444 -0.0529 -0.0439 -0.2642 -0.2973 -0.2582 0.3521 -0.0182 -0.2603 -0.2298 0.1708 -0.0823 -0.5637 -0.2548 -0.1495 -0.0794 0.2375 -0.2749 0.1007 0.0925 0.0888 0.0952 0.0998 0.1043 0.0884 0.0990 0.1207 0.0934 0.1012 0.0844 0.0942 0.0874 0.0935 0.1241 0.1055 0.0919 0.1020 0.1079 0.0836 0.0768 0.2823 0.0878 0.0909 0.0803
va: 2.1148 2.0377 3.7556 3.8456 3.7928 3.8809 3.9155 3.8933 4.2027 3.7134 3.9454 3.9310 3.8523 3.7061 4.0453 3.9518 3.8379 3.8787 3.3651 3.9545 1.0222 1.0337 1.0025 1.0174 1.0025 0.9986 1.0027 1.0020 1.0066 0.9987 0.9962 1.0140 0.9964 1.0081 0.9948 1.0144 0.9981 1.0067 0.9989 1.0169 0.9983 1.0013 0.9481 0.9988 1.0058 0.9975
dispcorr: -0.020693684 hartree
energy: -852.029969926169
dipole: 6.48156 -6.42079 0.06078 12.52611 -12.34145 0.18466 -1.11281 0.55635 -0.55646
magnitude: 0.58945 au
magnitude: 1.49825 debye
