program: Gaussian 09
title: 000074652
version: EM64L-G09RevD.01
frameworkgroup: C1[X(C12H16O3)]
method: RPBEPBE
basis: SDD
operation: Freq
keyword: #pfreq=noraman
keyword: PBEPBE/SDD
title: #p freq=noraman PBEPBE/SDD
converged: YES YES NO NO
title: Mulliken charges:
elementType: O O O C C C C C C C C C C C C H H H H H H H H H H H H H H H H
charge: -0.251000 -0.426085 -0.189951 0.126505 0.546317 -0.697825 -0.698622 -0.749401 -0.561915 -0.436336 0.327927 -0.228526 -0.388111 -0.336305 0.159669 0.222234 0.207485 0.218120 0.217955 0.207580 0.222292 0.221266 0.214352 0.214699 0.261360 0.230088 0.225805 0.259360 0.245980 0.245637 0.389444
chargesum: 0.00000
title: Mulliken charges with hydrogens summed into heavy atoms:
elementType: O O O C C C C C C C C C C C C
charge: -0.251000 -0.036641 -0.189951 0.126505 0.546317 -0.049985 -0.050795 -0.099083 -0.300555 -0.206248 0.327927 -0.002721 -0.128752 0.155313 0.159669
polarizability: 1.81129651e+02 -1.29855015e+00 1.50596997e+02 -1.44074069e-01 -4.07173126e-02 8.53353933e+01
1716.lowfreq: 0.0003 0.0007 0.0008 4.8659 9.6871 16.5494 26.6077 28.7310 57.6194
frequency: 26.5576 28.3094 57.4377 74.1005 112.8990 143.1271 171.4094 213.7952 227.7377 230.2731 258.0353 300.5642 312.3396 322.2515 337.5147 340.0276 383.7403 439.8885 462.9426 504.3019 511.7257 522.2808 534.9724 614.5093 621.8623 627.8640 688.1203 707.3943 801.8040 804.6624 870.7730 876.2778 899.2849 901.8685 920.0425 931.7743 944.0818 977.5972 986.1532 1007.6134 1013.3415 1021.1472 1026.7646 1058.0511 1082.2574 1125.5483 1178.3246 1203.3691 1206.2938 1212.5680 1220.3172 1255.8141 1278.4108 1311.9539 1369.8270 1374.7364 1375.1041 1391.2599 1403.1905 1423.3130 1451.2814 1460.9729 1465.4036 1467.0606 1478.3286 1490.0540 1491.5392 1497.9943 1600.5317 1604.9106 1706.0223 2956.7971 2971.3135 2973.2617 2977.9267 3010.1722 3066.8057 3068.6180 3068.9420 3076.6359 3079.5215 3083.4524 3129.2527 3149.8586 3171.4998 3174.4617 3526.7352
redmass: 8.4063 3.5556 5.0500 5.3523 2.5727 2.7312 6.1808 1.0677 2.9339 4.9053 1.1240 3.6229 2.3221 1.1220 4.9723 2.7299 2.4175 3.4138 2.9906 4.1945 1.7150 3.0972 4.8685 6.2402 3.7170 1.6134 5.9925 1.9087 1.4844 3.6217 1.6045 3.9543 1.4258 3.4808 1.6889 1.6624 1.2054 1.3313 6.1925 1.8786 3.2327 1.5728 1.3825 2.8046 1.6383 1.7061 1.1300 1.1094 2.7967 3.2626 2.6755 1.6907 3.6093 1.3068 2.5333 1.2132 1.1915 2.8768 1.2190 2.8736 1.1206 1.0506 1.0485 1.1108 1.1394 1.7062 1.0578 1.0964 6.7192 5.9617 9.2795 1.0553 1.0351 1.0347 1.0358 1.1033 1.1005 1.0997 1.1000 1.0985 1.0996 1.0990 1.0861 1.0933 1.0905 1.0960 1.0643
irintensity: 0.2076 0.6854 0.4880 0.9343 3.6604 6.4881 1.4580 0.0228 0.0610 0.7058 0.0228 0.1619 0.8768 0.0010 3.3446 0.8660 0.0193 0.9746 3.5339 14.2469 43.8318 2.1637 18.5951 17.3763 9.8920 116.7589 1.4434 33.7557 44.4252 0.9780 22.0404 1.5546 2.3179 39.0756 3.0702 2.5088 0.0263 1.1288 5.4245 0.2316 311.8523 62.3800 0.1233 80.1244 6.5994 4.5493 12.9164 0.0309 6.8428 89.4315 65.7230 19.1608 74.7368 0.5448 10.4929 20.0307 19.2932 4.6870 9.4092 67.2600 59.1772 0.1031 0.9823 0.2359 27.9270 12.3477 12.3606 27.7345 49.6982 112.2945 213.2543 39.0909 32.2063 34.0018 29.1387 18.1365 3.4817 10.9907 21.6942 115.9121 22.8585 50.0519 9.5679 26.4364 12.2946 4.1367 33.9856
temp: 298.150 k
press: 1.00000 atm
elementType: 8 8 8 6 6 6 6 6 6 6 6 6 6 6 6 1 1 1 1 1 1 1 1 1 1 1 1 1 1 1 1
symmnumber: 1
zpe: 666492.6 jmol-1
zpe.correction: 0.253854 hartree
zpe.thermalcorrener: 0.269450 hartree
zpe.thermalcorrenthalpy: 0.270394 hartree
zpe.thermalcorrgfe: 0.209931 hartree
zpe.sumelectzpe: -691.400191 hartree
zpe.sumelectthermal: -691.384595 hartree
zpe.sumelectthermalent: -691.383651 hartree
zpe.sumelectthermalfe: -691.444114 hartree
dipole: 1.4700 -2.8683 -0.0157
dipole: 3.2231
quadrupole: -84.4864 -87.0151 -92.1684
quadrupole: 12.1756 0.0630 -0.0415
quadrupole: 3.4036 0.8749 -4.2785 12.1756 0.0630 -0.0415
hfenergy: -691.6540448 hartree
pointgroup: C01 [X(C12H16O3)]
dipole: -0.5704816 -1.1284584 0.0953361 debye
polarizability: 181.0642228|1.6933439|150.0957479|1.9557285|-5.805857|85.9020703 unknown
InChI: InChI=1S/C12H16O3/c1-12(2,3)9-5-4-6-10(7-9)15-8-11(13)14/h4-7,13H,8H2,1-3H3
charge 0 multiplicity 1
31 atoms
O  1.972036 0.740356 -0.073891
O  4.470342 -1.8708 0.241371
O  4.732633 0.435766 0.028381
C  -2.817448 -1.00749 -0.017566
C  -1.760139 0.121863 -0.091966
C  -3.676655 -0.992218 -1.318123
C  -3.742296 -0.766184 1.213848
C  -2.182087 -2.414492 0.125041
C  -0.36707 -0.146065 -0.041542
C  -2.179681 1.472327 -0.219018
C  0.570165 0.913322 -0.116797
C  -1.236362 2.521367 -0.294303
C  0.14543 2.254063 -0.244497
C  2.469663 -0.612559 0.069611
C  3.990188 -0.555766 0.103547
H  -3.045327 -1.166622 -2.208612
H  -4.446043 -1.786115 -1.276261
H  -4.192432 -0.025258 -1.453971
H  -4.257606 0.208587 1.151827
H  -4.514777 -1.55612 1.27208
H  -3.159311 -0.780491 2.152953
H  -2.981282 -3.176431 0.174028
H  -1.537571 -2.664401 -0.738401
H  -1.581892 -2.502497 1.049926
H  -0.023002 -1.178535 0.054765
H  -3.247662 1.712296 -0.26082
H  -1.579899 3.55707 -0.392874
H  0.895995 3.047577 -0.300848
H  2.114809 -1.087706 1.007771
H  2.161378 -1.260743 -0.776957
H  5.465002 -1.859201 0.2665
