program: Orca
programVersion: 5.0.2
elementType: O O C C C C C C C C C C C C C C C C C C H H H H H H H H H H H H H H H H H H H H H H H H H H
charge: 0
multiplicity: 1
keywords: wb97x-d3
keywords: def2-TZVPP
keywords: def2/J RIJCOSX
keywords: DEFGRID2
keywords: scfconv7
keywords: smallprint printgap noloewdin
keywords: NOSOSCF
formula: C18H26O2
InChI: InChI=1/C18H26O2/c1-8-10-13(5)15(9-2)20-17(19)16-14(11-12(3)4)18(16,6)7/h2,10-11,14-16H,8H2,1,3-7H3
46 atoms
O  -0.818578 -0.834679 0.544611
O  -0.896203 0.734975 2.133572
C  2.084553 -1.278275 1.391157
C  2.023424 -0.407826 0.174512
C  1.217051 -0.030805 1.412882
C  1.477901 -2.659471 1.320602
C  3.297269 -1.232447 2.291728
C  3.131199 0.462342 -0.261689
C  -0.256185 0.001745 1.41683
C  3.430457 0.795463 -1.522287
C  2.675658 0.340945 -2.734844
C  4.604957 1.678261 -1.823315
C  -2.246619 -0.789692 0.38087
C  -2.621007 0.283415 -0.615459
C  -2.639753 -2.120807 -0.071947
C  -2.07033 0.114685 -1.998032
C  -3.390054 1.291978 -0.202132
C  -3.853543 2.462337 -1.008106
C  -3.003379 -3.199113 -0.4541
C  -3.066879 3.725457 -0.664089
H  1.424604 -0.827673 -0.625225
H  1.625989 0.779808 2.005954
H  2.261491 -3.384389 1.090479
H  1.039937 -2.947151 2.278673
H  0.713139 -2.761957 0.554852
H  3.051969 -1.639987 3.274474
H  4.107224 -1.836348 1.877409
H  3.679697 -0.224401 2.447231
H  3.758939 0.870139 0.525207
H  3.287209 -0.334267 -3.339996
H  1.742772 -0.173737 -2.511556
H  2.433827 1.19252 -3.375639
H  5.30947 1.179599 -2.494796
H  4.289128 2.591827 -2.334752
H  5.147941 1.967818 -0.923458
H  -2.728821 -0.593254 1.342484
H  -2.486296 -0.769131 -2.487755
H  -2.278751 0.970956 -2.635356
H  -0.98625 -0.01622 -1.980711
H  -3.700771 1.299118 0.83968
H  -4.913145 2.633638 -0.799963
H  -3.779473 2.26565 -2.078174
H  -3.31832 -4.165353 -0.780177
H  -3.44879 4.586064 -1.215131
H  -3.130719 3.959334 0.399908
H  -2.011297 3.610186 -0.914511
elementType: O C H
totalener: -852.00996454 hartree
nucrepener: 1570.39447436 hartree
electener: -2422.40443890 hartree
oneelecener: -4274.12526793 hartree
twoeener: 1851.72082903 hartree
cpcmener: -0.02225152 hartree
kineticenergy: 847.96987460 hartree
xcener: -85.214382271686 hartree
chargesum: -0.0000000
charge: -0.278926 -0.464571 0.098927 0.046190 -0.098461 -0.265019 -0.285007 -0.278076 0.404912 -0.040461 -0.252257 -0.222898 0.140378 -0.146710 -0.528961 -0.253649 -0.068052 -0.095594 0.194075 -0.265073 0.096688 0.088130 0.093562 0.099557 0.086387 0.098000 0.098360 0.090426 0.115116 0.101949 0.081960 0.093389 0.092537 0.094096 0.088347 0.124057 0.105636 0.099700 0.093256 0.123032 0.076907 0.070263 0.283135 0.091641 0.087959 0.085145
qa: -0.2789 -0.4646 0.0989 0.0462 -0.0985 -0.2650 -0.2850 -0.2781 0.4049 -0.0405 -0.2523 -0.2229 0.1404 -0.1467 -0.5290 -0.2536 -0.0681 -0.0956 0.1941 -0.2651 0.0967 0.0881 0.0936 0.0996 0.0864 0.0980 0.0984 0.0904 0.1151 0.1019 0.0820 0.0934 0.0925 0.0941 0.0883 0.1241 0.1056 0.0997 0.0933 0.1230 0.0769 0.0703 0.2831 0.0916 0.0880 0.0851
va: 2.1172 2.0459 3.7082 3.7593 3.8257 3.9065 3.9218 3.8777 4.1960 3.7666 3.9436 3.9242 3.9060 3.7304 3.9106 3.9535 3.8021 3.9281 3.4287 3.9112 1.0156 1.0314 1.0001 1.0003 1.0113 1.0006 1.0007 1.0073 1.0132 0.9964 1.0100 0.9976 0.9952 0.9966 1.0087 1.0234 0.9975 1.0084 1.0005 1.0099 1.0048 1.0083 0.9479 1.0049 1.0019 1.0021
dispcorr: -0.021059365 hartree
energy: -852.031023901307
dipole: 10.97687 -10.46493 0.51194 7.72628 -8.14641 -0.42012 -10.66528 9.49741 -1.16787
magnitude: 1.34258 au
magnitude: 3.41256 debye
