program: Orca
programVersion: 5.0.2
elementType: O O C C C C C C C C C C C C C C C C C C H H H H H H H H H H H H H H H H H H H H H H H H H H
charge: 0
multiplicity: 1
keywords: wb97x-d3
keywords: def2-TZVPP
keywords: def2/J RIJCOSX
keywords: DEFGRID2
keywords: scfconv7
keywords: smallprint printgap noloewdin
keywords: NOSOSCF
formula: C18H26O2
InChI: InChI=1/C18H26O2/c1-8-10-13(5)15(9-2)20-17(19)16-14(11-12(3)4)18(16,6)7/h2,10-11,14-16H,8H2,1,3-7H3
46 atoms
O  -0.879612 0.210851 0.413584
O  0.230384 -0.687517 2.132929
C  2.418636 1.433932 1.288375
C  2.779507 0.083524 0.77435
C  1.391688 0.631375 0.500731
C  2.249997 1.637771 2.773484
C  2.952623 2.653686 0.576138
C  3.729573 -0.117768 -0.350014
C  0.23042 -0.016972 1.129412
C  3.574562 -1.005587 -1.335856
C  2.389119 -1.914273 -1.456285
C  4.593733 -1.148304 -2.425109
C  -2.082329 -0.424619 0.829638
C  -3.266801 0.172072 0.091654
C  -2.004105 -1.862542 0.561959
C  -4.570387 -0.137092 0.761516
C  -3.114483 0.862744 -1.037314
C  -4.19939 1.465443 -1.874458
C  -1.959977 -3.03714 0.315244
C  -4.421704 0.669584 -3.158583
H  2.793448 -0.69343 1.53611
H  1.209984 0.989716 -0.506163
H  3.190571 1.984323 3.205792
H  1.494858 2.397721 2.983195
H  1.967529 0.729324 3.30099
H  2.304716 3.514767 0.751436
H  3.947516 2.910367 0.946347
H  3.026193 2.511533 -0.502319
H  4.627493 0.494825 -0.342137
H  1.744436 -1.910873 -0.579276
H  1.778034 -1.63913 -2.32085
H  2.71131 -2.944709 -1.625319
H  5.01514 -2.156783 -2.439534
H  4.1402 -0.990121 -3.407423
H  5.415795 -0.440815 -2.316648
H  -2.229901 -0.273597 1.905599
H  -4.62728 0.338821 1.743847
H  -5.429621 0.191276 0.181906
H  -4.683794 -1.211263 0.927204
H  -2.114716 0.997683 -1.437165
H  -3.912498 2.487852 -2.135828
H  -5.13871 1.543738 -1.326099
H  -1.919563 -4.080285 0.093935
H  -4.767343 -0.341465 -2.938623
H  -5.171061 1.148482 -3.790622
H  -3.503031 0.58576 -3.741683
elementType: O C H
totalener: -852.00925693 hartree
nucrepener: 1551.38247074 hartree
electener: -2403.39172767 hartree
oneelecener: -4236.34872484 hartree
twoeener: 1832.95699717 hartree
cpcmener: -0.02129042 hartree
kineticenergy: 847.96549876 hartree
xcener: -85.213971085555 hartree
chargesum: -0.0000000
charge: -0.280829 -0.461226 0.141034 -0.007030 -0.111916 -0.279564 -0.282977 -0.298804 0.383098 -0.013502 -0.235110 -0.228356 0.214059 -0.085602 -0.505169 -0.253867 -0.144911 -0.091460 0.108567 -0.264365 0.103756 0.097979 0.094168 0.098962 0.092912 0.097707 0.098309 0.092918 0.120809 0.079374 0.101369 0.100748 0.096291 0.093484 0.089183 0.124878 0.103210 0.095584 0.103579 0.126178 0.074744 0.068637 0.281823 0.084659 0.091186 0.085483
qa: -0.2808 -0.4612 0.1410 -0.0070 -0.1119 -0.2796 -0.2830 -0.2988 0.3831 -0.0135 -0.2351 -0.2284 0.2141 -0.0856 -0.5052 -0.2539 -0.1449 -0.0915 0.1086 -0.2644 0.1038 0.0980 0.0942 0.0990 0.0929 0.0977 0.0983 0.0929 0.1208 0.0794 0.1014 0.1007 0.0963 0.0935 0.0892 0.1249 0.1032 0.0956 0.1036 0.1262 0.0747 0.0686 0.2818 0.0847 0.0912 0.0855
va: 2.1233 2.0426 3.7010 3.8033 3.8298 3.8963 3.9079 3.8935 4.1604 3.7128 3.9390 3.9318 3.8160 3.8220 3.7871 3.9515 3.8276 3.9237 3.6267 3.9102 1.0260 1.0223 1.0012 0.9990 1.0180 1.0031 1.0002 1.0022 1.0046 1.0108 0.9984 1.0004 0.9964 0.9967 1.0063 1.0151 0.9984 1.0066 0.9985 1.0198 1.0045 1.0089 0.9501 1.0022 1.0051 1.0022
dispcorr: -0.020339994 hartree
energy: -852.029596920769
dipole: 1.76289 -1.94119 -0.17830 5.94231 -5.33024 0.61207 -11.45301 10.43856 -1.01445
magnitude: 1.19814 au
magnitude: 3.04542 debye
