program: Orca
programVersion: 5.0.2
elementType: O O C C C C C C C C C C C C C C C C C C H H H H H H H H H H H H H H H H H H H H H H H H H H
charge: 0
multiplicity: 1
keywords: wb97x-d3
keywords: def2-TZVPP
keywords: def2/J RIJCOSX
keywords: DEFGRID2
keywords: scfconv7
keywords: smallprint printgap noloewdin
keywords: NOSOSCF
formula: C18H26O2
InChI: InChI=1/C18H26O2/c1-8-10-13(5)15(9-2)20-17(19)16-14(11-12(3)4)18(16,6)7/h2,10-11,14-16H,8H2,1,3-7H3
46 atoms
O  -0.709819 -1.09404 0.189165
O  -0.384877 -0.240724 2.229732
C  2.202332 -2.01097 0.251266
C  2.119562 -0.68241 -0.415858
C  1.505025 -0.866665 0.968854
C  1.428595 -3.174383 -0.321903
C  3.511019 -2.433249 0.877915
C  3.283056 0.221102 -0.594459
C  0.06073 -0.707554 1.207199
C  3.179987 1.540579 -0.777044
C  1.862158 2.256971 -0.784004
C  4.383613 2.397184 -1.019527
C  -2.115005 -0.784181 0.246045
C  -2.341811 0.62115 -0.264442
C  -2.781126 -1.79295 -0.571732
C  -2.024275 0.849152 -1.710797
C  -2.775401 1.543153 0.597508
C  -3.051216 2.987397 0.334654
C  -3.361186 -2.607037 -1.236311
C  -4.513555 3.342884 0.590988
H  1.381195 -0.629405 -1.211718
H  2.0786 -0.442892 1.785363
H  1.062471 -3.834582 0.466715
H  0.580428 -2.872918 -0.931607
H  2.088835 -3.765218 -0.960337
H  4.042848 -1.604141 1.344946
H  3.339574 -3.186997 1.648922
H  4.172823 -2.87389 0.129314
H  4.269974 -0.232422 -0.61158
H  1.495049 2.391314 -1.805171
H  1.087793 1.7300 -0.228681
H  1.955826 3.256062 -0.35559
H  5.304963 1.815797 -1.055928
H  4.291526 2.943265 -1.962412
H  4.490462 3.15325 -0.23686
H  -2.477319 -0.876333 1.27335
H  -2.750981 0.350911 -2.357151
H  -2.022906 1.903699 -1.976704
H  -1.043423 0.447808 -1.974158
H  -2.970221 1.2257 1.619302
H  -2.779132 3.272236 -0.68193
H  -2.421632 3.585383 1.001159
H  -3.872208 -3.338062 -1.822505
H  -4.809909 3.10455 1.613902
H  -4.685707 4.409097 0.438628
H  -5.177684 2.799102 -0.082273
elementType: O C H
totalener: -852.00797723 hartree
nucrepener: 1583.47119299 hartree
electener: -2435.47917022 hartree
oneelecener: -4300.27066312 hartree
twoeener: 1864.79149290 hartree
cpcmener: -0.02110368 hartree
kineticenergy: 847.97202228 hartree
xcener: -85.213697148621 hartree
chargesum: 0.0000000
charge: -0.271681 -0.465811 0.158026 -0.020358 -0.102359 -0.270522 -0.295649 -0.308100 0.386526 0.007115 -0.262542 -0.224056 0.137257 -0.148353 -0.525349 -0.277663 -0.068709 -0.082921 0.201340 -0.263268 0.110884 0.089961 0.101608 0.087885 0.091861 0.091099 0.099186 0.099141 0.123050 0.107609 0.078211 0.097812 0.087242 0.095503 0.094384 0.121249 0.111741 0.105524 0.099706 0.117939 0.066655 0.074608 0.283683 0.085745 0.090152 0.084639
qa: -0.2717 -0.4658 0.1580 -0.0204 -0.1024 -0.2705 -0.2956 -0.3081 0.3865 0.0071 -0.2625 -0.2241 0.1373 -0.1484 -0.5253 -0.2777 -0.0687 -0.0829 0.2013 -0.2633 0.1109 0.0900 0.1016 0.0879 0.0919 0.0911 0.0992 0.0991 0.1230 0.1076 0.0782 0.0978 0.0872 0.0955 0.0944 0.1212 0.1117 0.1055 0.0997 0.1179 0.0667 0.0746 0.2837 0.0857 0.0902 0.0846
va: 2.1122 2.0408 3.7108 3.8048 3.8295 3.8928 3.9205 3.8651 4.1833 3.6898 3.9548 3.9311 3.8861 3.7313 3.9220 3.9445 3.8138 3.9178 3.4205 3.9167 1.0106 1.0286 0.9999 1.0118 1.0014 1.0020 1.0022 0.9990 1.0051 0.9952 1.0041 1.0035 1.0076 0.9946 0.9961 1.0248 0.9972 1.0075 1.0006 1.0153 1.0164 1.0044 0.9474 1.0026 1.0048 1.0030
dispcorr: -0.022351664 hartree
energy: -852.030328896701
dipole: 6.55694 -6.26160 0.29535 11.93444 -11.67790 0.25654 -6.48844 5.25749 -1.23096
magnitude: 1.29163 au
magnitude: 3.28305 debye
