program: Orca
programVersion: 5.0.2
elementType: O O C C C C C C C C C C C C C C C C C C H H H H H H H H H H H H H H H H H H H H H H H H H H
charge: 0
multiplicity: 1
keywords: wb97x-d3
keywords: def2-TZVPP
keywords: def2/J RIJCOSX
keywords: DEFGRID2
keywords: scfconv7
keywords: smallprint printgap noloewdin
keywords: NOSOSCF
formula: C18H26O2
InChI: InChI=1/C18H26O2/c1-8-10-13(5)15(9-2)20-17(19)16-14(11-12(3)4)18(16,6)7/h2,10-11,14-16H,8H2,1,3-7H3
46 atoms
O  -0.769514 0.010975 0.097652
O  0.300385 -0.526188 1.991308
C  2.347986 1.58758 0.757815
C  2.879866 0.195977 0.716412
C  1.49459 0.469892 0.171778
C  1.994894 2.196525 2.091744
C  2.853983 2.596926 -0.24385
C  3.977022 -0.211731 -0.199225
C  0.31699 -0.06724 0.874739
C  4.052817 -1.386695 -0.829538
C  3.009724 -2.455121 -0.713166
C  5.209936 -1.72215 -1.720142
C  -2.017341 -0.517169 0.585135
C  -3.090174 0.454204 0.163404
C  -2.159528 -1.87804 0.079218
C  -2.919843 1.832535 0.731627
C  -4.093604 0.108136 -0.64042
C  -5.192039 1.028308 -1.090717
C  -2.246371 -3.004275 -0.327292
C  -6.141308 0.367031 -2.078309
H  2.873496 -0.310151 1.679434
H  1.394735 0.497653 -0.907661
H  2.865552 2.713055 2.501502
H  1.195355 2.933567 1.989948
H  1.680623 1.459806 2.828798
H  2.116015 3.386111 -0.400044
H  3.770111 3.071038 0.115131
H  3.069787 2.151166 -1.215155
H  4.78785 0.499606 -0.333031
H  2.524139 -2.629539 -1.6776
H  3.465611 -3.405732 -0.424315
H  2.232731 -2.226821 0.014206
H  4.870507 -1.952056 -2.733829
H  5.931582 -0.90765 -1.783701
H  5.735597 -2.611712 -1.363089
H  -1.99318 -0.555433 1.679028
H  -2.270357 2.44982 0.10605
H  -3.872658 2.353456 0.820852
H  -2.469044 1.802954 1.725836
H  -4.13914 -0.912199 -1.010953
H  -4.762325 1.926618 -1.544006
H  -5.758409 1.382329 -0.222793
H  -2.319132 -4.006245 -0.687883
H  -6.626625 -0.506938 -1.640439
H  -6.925685 1.056619 -2.391546
H  -5.614929 0.037884 -2.975871
elementType: O C H
totalener: -852.00967170 hartree
nucrepener: 1537.16021295 hartree
electener: -2389.16988465 hartree
oneelecener: -4207.80408448 hartree
twoeener: 1818.63419983 hartree
cpcmener: -0.02005844 hartree
kineticenergy: 847.96809668 hartree
xcener: -85.211531063897 hartree
chargesum: 0.0000000
charge: -0.278648 -0.466313 0.147882 -0.016144 -0.120402 -0.274086 -0.286249 -0.294926 0.402136 -0.013806 -0.238435 -0.228894 0.108195 -0.132239 -0.510667 -0.298243 -0.076258 -0.063782 0.207065 -0.282244 0.102571 0.096544 0.096476 0.097308 0.091282 0.097807 0.099286 0.093234 0.121066 0.099324 0.099994 0.079591 0.093774 0.089266 0.096079 0.132741 0.106408 0.103078 0.104130 0.112947 0.080775 0.078420 0.280757 0.085921 0.089907 0.087374
qa: -0.2786 -0.4663 0.1479 -0.0161 -0.1204 -0.2741 -0.2862 -0.2949 0.4021 -0.0138 -0.2384 -0.2289 0.1082 -0.1322 -0.5107 -0.2982 -0.0763 -0.0638 0.2071 -0.2822 0.1026 0.0965 0.0965 0.0973 0.0913 0.0978 0.0993 0.0932 0.1211 0.0993 0.1000 0.0796 0.0938 0.0893 0.0961 0.1327 0.1064 0.1031 0.1041 0.1129 0.0808 0.0784 0.2808 0.0859 0.0899 0.0874
va: 2.0993 2.0426 3.7100 3.8140 3.8152 3.8931 3.9058 3.8922 4.1489 3.7099 3.9359 3.9311 3.8913 3.7178 4.0808 3.9650 3.7617 3.8905 3.4450 3.9589 1.0281 1.0303 1.0013 1.0004 1.0176 1.0034 0.9997 1.0021 1.0038 0.9985 1.0002 1.0165 0.9964 1.0063 0.9963 1.0147 0.9983 1.0007 1.0040 1.0104 0.9994 1.0021 0.9503 0.9969 1.0057 0.9974
dispcorr: -0.020162473 hartree
energy: -852.029834175895
dipole: 1.85948 -1.99240 -0.13291 7.69007 -7.06081 0.62926 -7.81897 6.87476 -0.94421
magnitude: 1.14244 au
magnitude: 2.90385 debye
