program: Orca
programVersion: 5.0.2
elementType: O O C C C C C C C C C C C C C C C C C C H H H H H H H H H H H H H H H H H H H H H H H H H H
charge: 0
multiplicity: 1
keywords: wb97x-d3
keywords: def2-TZVPP
keywords: def2/J RIJCOSX
keywords: DEFGRID2
keywords: scfconv7
keywords: smallprint printgap noloewdin
keywords: NOSOSCF
formula: C18H26O2
InChI: InChI=1/C18H26O2/c1-8-10-13(5)15(9-2)20-17(19)16-14(11-12(3)4)18(16,6)7/h2,10-11,14-16H,8H2,1,3-7H3
46 atoms
O  -0.984981 -0.592812 -0.323127
O  -0.06214 0.044562 1.618381
C  2.130909 1.227812 -0.300658
C  2.610824 -0.071801 0.268785
C  1.247555 -0.00757 -0.385212
C  1.797825 2.353648 0.646489
C  2.709358 1.704249 -1.610341
C  3.674721 -0.881263 -0.372295
C  0.031438 -0.162636 0.433118
C  4.918675 -1.032372 0.091328
C  5.437469 -0.36701 1.328439
C  5.908381 -1.906292 -0.617648
C  -2.276172 -0.79663 0.278683
C  -3.256033 0.186174 -0.317556
C  -2.653482 -2.183437 0.019561
C  -3.492399 0.066458 -1.791092
C  -3.842798 1.063119 0.499309
C  -4.867657 2.091401 0.142902
C  -2.985457 -3.318205 -0.188632
C  -6.268122 1.652308 0.565307
H  2.581063 -0.113603 1.353423
H  1.175577 -0.442252 -1.376449
H  1.512106 2.010892 1.638096
H  2.672388 2.996239 0.765782
H  0.988243 2.974322 0.256956
H  2.883339 0.892541 -2.316223
H  2.039886 2.4212 -2.089644
H  3.664942 2.205869 -1.442966
H  3.405422 -1.394552 -1.291266
H  5.725594 -1.107816 2.07903
H  6.340567 0.205826 1.102261
H  4.724406 0.314535 1.788752
H  5.481901 -2.379828 -1.502103
H  6.786133 -1.334577 -0.930889
H  6.2764 -2.69721 0.041602
H  -2.214694 -0.646892 1.358974
H  -2.554476 0.074321 -2.349508
H  -3.993929 -0.874183 -2.031246
H  -4.111094 0.871885 -2.180669
H  -3.589653 1.017076 1.555806
H  -4.861129 2.3121 -0.925242
H  -4.618474 3.025935 0.652789
H  -3.278413 -4.327618 -0.374184
H  -6.573995 0.751104 0.032278
H  -6.31457 1.437199 1.634135
H  -7.001578 2.431503 0.353286
elementType: O C H
totalener: -852.01134100 hartree
nucrepener: 1514.90854546 hartree
electener: -2366.91988646 hartree
oneelecener: -4163.34002242 hartree
twoeener: 1796.42013596 hartree
cpcmener: -0.02041140 hartree
kineticenergy: 847.97410615 hartree
xcener: -85.212801970271 hartree
chargesum: 0.0000000
charge: -0.291398 -0.466917 0.152359 0.004049 -0.155662 -0.295726 -0.262796 -0.269283 0.417065 -0.030763 -0.252381 -0.227192 0.192603 -0.140484 -0.538816 -0.265067 -0.074568 -0.095079 0.180715 -0.263966 0.097452 0.089571 0.094265 0.094629 0.100517 0.089728 0.098261 0.095458 0.119841 0.098023 0.094094 0.088776 0.088572 0.093384 0.093809 0.119450 0.105083 0.103201 0.099608 0.124043 0.072136 0.075903 0.283638 0.086215 0.086220 0.091432
qa: -0.2914 -0.4669 0.1524 0.0040 -0.1557 -0.2957 -0.2628 -0.2693 0.4171 -0.0308 -0.2524 -0.2272 0.1926 -0.1405 -0.5388 -0.2651 -0.0746 -0.0951 0.1807 -0.2640 0.0975 0.0896 0.0943 0.0946 0.1005 0.0897 0.0983 0.0955 0.1198 0.0980 0.0941 0.0888 0.0886 0.0934 0.0938 0.1195 0.1051 0.1032 0.0996 0.1240 0.0721 0.0759 0.2836 0.0862 0.0862 0.0914
va: 2.1163 2.0476 3.6598 3.7740 3.9099 3.9074 3.9067 3.8771 4.1802 3.7097 3.9449 3.9272 3.8205 3.7892 3.9787 3.9446 3.8006 3.9226 3.4430 3.9129 1.0253 1.0390 1.0184 1.0009 0.9991 1.0029 1.0028 1.0031 1.0080 0.9975 0.9980 1.0080 1.0082 0.9967 0.9954 1.0399 1.0076 0.9953 1.0077 1.0062 1.0098 1.0044 0.9476 1.0012 1.0017 1.0050
dispcorr: -0.019421009 hartree
energy: -852.030762010855
dipole: 6.65667 -6.56234 0.09433 10.19505 -9.83554 0.35951 -3.98652 3.07331 -0.91322
magnitude: 0.98596 au
magnitude: 2.50610 debye
