program: Orca
programVersion: 5.0.2
elementType: O O C C C C C C C C C C C C C C C C C C H H H H H H H H H H H H H H H H H H H H H H H H H H
charge: 0
multiplicity: 1
keywords: wb97x-d3
keywords: def2-TZVPP
keywords: def2/J RIJCOSX
keywords: DEFGRID2
keywords: scfconv7
keywords: smallprint printgap noloewdin
keywords: NOSOSCF
formula: C18H26O2
InChI: InChI=1/C18H26O2/c1-8-10-13(5)15(9-2)20-17(19)16-14(11-12(3)4)18(16,6)7/h2,10-11,14-16H,8H2,1,3-7H3
46 atoms
O  -0.758287 -0.993347 -0.200867
O  -0.187831 0.431604 1.429359
C  1.756794 1.524132 -0.773437
C  2.516946 0.670366 0.180572
C  1.252949 0.120796 -0.455059
C  1.023919 2.737382 -0.25455
C  2.285542 1.708368 -2.17559
C  3.836285 0.075994 -0.159542
C  0.055678 -0.098905 0.371935
C  4.28936 -1.093093 0.300721
C  3.500909 -1.979955 1.213492
C  5.643789 -1.61019 -0.075534
C  -2.035816 -1.233516 0.417226
C  -3.035564 -0.198235 -0.045247
C  -2.423873 -2.58469 0.024345
C  -3.364197 -0.214994 -1.507004
C  -3.537394 0.646221 0.857552
C  -4.506418 1.759068 0.622482
C  -2.773767 -3.689524 -0.288199
C  -3.841195 3.124139 0.78506
H  2.388915 0.943689 1.22563
H  1.390975 -0.602508 -1.250776
H  0.764928 2.665715 0.799294
H  1.654201 3.62134 -0.372721
H  0.105014 2.916085 -0.817303
H  2.753901 0.807424 -2.571931
H  1.477561 1.985227 -2.855648
H  3.027164 2.509741 -2.204427
H  4.480797 0.657974 -0.812957
H  2.520265 -1.57925 1.464979
H  3.355221 -2.965994 0.764199
H  4.041576 -2.147414 2.149017
H  6.174846 -0.929967 -0.74157
H  6.264822 -1.769109 0.810079
H  5.566478 -2.579772 -0.574904
H  -1.938521 -1.202164 1.505887
H  -2.461195 -0.28514 -2.116677
H  -3.985071 -1.076844 -1.764632
H  -3.897992 0.678839 -1.822653
H  -3.197465 0.548544 1.885891
H  -5.319672 1.671636 1.34891
H  -4.968176 1.689073 -0.362891
H  -3.075872 -4.674775 -0.565853
H  -4.567233 3.929007 0.662765
H  -3.389998 3.233541 1.772648
H  -3.053466 3.268592 0.043923
elementType: O C H
totalener: -852.01133159 hartree
nucrepener: 1560.21358238 hartree
electener: -2412.22491397 hartree
oneelecener: -4254.07464546 hartree
twoeener: 1841.84973149 hartree
cpcmener: -0.02007382 hartree
kineticenergy: 847.97043779 hartree
xcener: -85.212679227403 hartree
chargesum: -0.0000000
charge: -0.286706 -0.469245 0.152545 -0.023165 -0.105713 -0.283970 -0.290095 -0.292083 0.388003 -0.012950 -0.242150 -0.226236 0.162451 -0.144891 -0.522797 -0.269746 -0.081668 -0.089549 0.201031 -0.262427 0.105094 0.092974 0.095385 0.096075 0.099594 0.093071 0.097256 0.098846 0.121721 0.081189 0.096880 0.100879 0.089279 0.094762 0.093934 0.122204 0.103510 0.106322 0.100643 0.120605 0.076361 0.067932 0.282580 0.092204 0.087366 0.082693
qa: -0.2867 -0.4692 0.1525 -0.0232 -0.1057 -0.2840 -0.2901 -0.2921 0.3880 -0.0129 -0.2421 -0.2262 0.1625 -0.1449 -0.5228 -0.2697 -0.0817 -0.0895 0.2010 -0.2624 0.1051 0.0930 0.0954 0.0961 0.0996 0.0931 0.0973 0.0988 0.1217 0.0812 0.0969 0.1009 0.0893 0.0948 0.0939 0.1222 0.1035 0.1063 0.1006 0.1206 0.0764 0.0679 0.2826 0.0922 0.0874 0.0827
va: 2.1127 2.0395 3.6949 3.8276 3.8108 3.8900 3.9115 3.8887 4.1716 3.7086 3.9387 3.9295 3.8572 3.7216 3.9540 3.9406 3.8206 3.9253 3.4207 3.9119 1.0244 1.0324 1.0179 1.0019 0.9987 1.0019 1.0030 0.9996 1.0033 1.0147 0.9990 0.9990 1.0064 0.9963 0.9968 1.0234 1.0089 0.9945 1.0062 1.0123 1.0049 1.0101 0.9478 1.0051 1.0025 1.0029
dispcorr: -0.020941423 hartree
energy: -852.032273008168
dipole: 5.83065 -5.78276 0.04788 10.75052 -10.80863 -0.05811 -4.43875 3.60807 -0.83068
magnitude: 0.83409 au
magnitude: 2.12008 debye
