program: Orca
programVersion: 5.0.2
elementType: O O C C C C C C C C C C C C C C C C C C H H H H H H H H H H H H H H H H H H H H H H H H H H
charge: 0
multiplicity: 1
keywords: wb97x-d3
keywords: def2-TZVPP
keywords: def2/J RIJCOSX
keywords: DEFGRID2
keywords: scfconv7
keywords: smallprint printgap noloewdin
keywords: NOSOSCF
formula: C18H26O2
InChI: InChI=1/C18H26O2/c1-8-10-13(5)15(9-2)20-17(19)16-14(11-12(3)4)18(16,6)7/h2,10-11,14-16H,8H2,1,3-7H3
46 atoms
O  -0.966508 -0.946103 -0.432277
O  -0.179526 0.22808 1.309258
C  1.935559 1.142734 -0.825953
C  2.528668 0.110959 0.085673
C  1.207863 -0.169409 -0.597621
C  1.421599 2.424537 -0.216925
C  2.523573 1.341804 -2.202814
C  3.717285 -0.686281 -0.273103
C  -0.02396 -0.24878 0.216247
C  4.813982 -0.859363 0.46809
C  5.035381 -0.24554 1.817342
C  5.945002 -1.714554 -0.021187
C  -2.249885 -1.063948 0.19929
C  -3.129398 0.103572 -0.187389
C  -2.806036 -2.345301 -0.223264
C  -3.518378 0.17627 -1.631682
C  -3.468045 0.976605 0.76072
C  -4.32352 2.194136 0.630979
C  -3.29593 -3.390637 -0.546994
C  -5.550552 2.120315 1.537599
H  2.421387 0.347625 1.138537
H  1.232317 -0.857594 -1.435626
H  1.056599 2.295606 0.798647
H  2.224672 3.163377 -0.192008
H  0.608662 2.84235 -0.814447
H  3.394519 1.997543 -2.152917
H  2.84213 0.411142 -2.670077
H  1.792371 1.807974 -2.865415
H  3.683531 -1.186121 -1.236823
H  5.194381 -1.019512 2.572196
H  5.93642 0.372732 1.812959
H  4.212228 0.38018 2.153523
H  6.872049 -1.13976 -0.090448
H  6.141146 -2.538729 0.669264
H  5.742559 -2.142277 -1.002423
H  -2.124568 -1.081036 1.28558
H  -2.636769 0.154239 -2.274384
H  -4.136016 -0.678383 -1.913807
H  -4.074246 1.079999 -1.868319
H  -3.091174 0.797246 1.764391
H  -4.639267 2.354604 -0.400087
H  -3.72831 3.069855 0.907696
H  -3.722367 -4.320955 -0.835808
H  -6.148096 3.029043 1.464632
H  -6.186382 1.276973 1.268712
H  -5.264121 1.997283 2.582916
totalener: -851.99628311 hartree
nucrepener: 1527.19946535 hartree
electener: -2379.19574846 hartree
oneelecener: -4187.31474142 hartree
twoeener: 1808.11899296 hartree
kineticenergy: 848.01659988 hartree
xcener: -85.218776372937 hartree
chargesum: 0.0000000
charge: -0.265999 -0.393911 0.094277 0.040799 -0.120362 -0.260451 -0.243066 -0.186853 0.360929 -0.048395 -0.237385 -0.204402 0.108934 -0.153988 -0.451398 -0.252445 -0.018883 -0.098365 0.208258 -0.245188 0.088646 0.074155 0.100230 0.085767 0.084230 0.091840 0.071487 0.090469 0.071994 0.087127 0.084207 0.083251 0.083092 0.084992 0.076630 0.109384 0.098645 0.101177 0.085184 0.092215 0.059331 0.073463 0.244956 0.082884 0.083732 0.078808
qa: -0.2660 -0.3939 0.0943 0.0408 -0.1204 -0.2605 -0.2431 -0.1869 0.3609 -0.0484 -0.2374 -0.2044 0.1089 -0.1540 -0.4514 -0.2524 -0.0189 -0.0984 0.2083 -0.2452 0.0886 0.0742 0.1002 0.0858 0.0842 0.0918 0.0715 0.0905 0.0720 0.0871 0.0842 0.0833 0.0831 0.0850 0.0766 0.1094 0.0986 0.1012 0.0852 0.0922 0.0593 0.0735 0.2450 0.0829 0.0837 0.0788
va: 2.1270 2.1126 3.7331 3.7852 3.9030 3.9147 3.9130 3.9009 4.2275 3.8206 3.9466 3.9355 3.9246 3.8247 3.9977 3.9477 3.8064 3.9273 3.4628 3.9162 1.0369 1.0398 1.0219 1.0012 1.0026 1.0044 1.0110 1.0045 1.0212 0.9989 0.9993 1.0154 0.9982 0.9981 1.0123 1.0245 1.0077 1.0003 1.0116 1.0218 1.0172 1.0043 0.9717 1.0069 1.0052 1.0055
dispcorr: -0.019467122 hartree
energy: -852.015750233723
dipole: 7.25048 -7.15507 0.09541 11.68616 -11.49361 0.19255 -1.28650 0.79814 -0.48836
magnitude: 0.53355 au
magnitude: 1.35618 debye
