program: Orca
programVersion: 5.0.2
elementType: O O C C C C C C C C C C C C C C C C C C H H H H H H H H H H H H H H H H H H H H H H H H H H
charge: 0
multiplicity: 1
keywords: wb97x-d3
keywords: def2-TZVPP
keywords: def2/J RIJCOSX
keywords: DEFGRID2
keywords: scfconv7
keywords: smallprint printgap noloewdin
keywords: NOSOSCF
formula: C18H26O2
InChI: InChI=1/C18H26O2/c1-8-10-13(5)15(9-2)20-17(19)16-14(11-12(3)4)18(16,6)7/h2,10-11,14-16H,8H2,1,3-7H3
46 atoms
O  -1.033932 -1.052305 -0.421662
O  -0.27059 0.006595 1.401911
C  1.930498 0.960695 -0.616504
C  2.467293 -0.127473 0.264149
C  1.17119 -0.347874 -0.472203
C  1.410787 2.227783 0.017357
C  2.593147 1.19304 -1.952428
C  3.66276 -0.924534 -0.106015
C  -0.091396 -0.423999 0.293387
C  4.902158 -0.6914 0.327725
C  5.253902 0.437062 1.248909
C  6.048809 -1.564547 -0.082824
C  -2.350506 -1.121613 0.145454
C  -3.142304 0.105233 -0.246618
C  -2.952602 -2.357805 -0.342699
C  -3.454175 0.240672 -1.704996
C  -3.469858 0.973462 0.709633
C  -4.239723 2.246392 0.576035
C  -3.476782 -3.367942 -0.720497
C  -5.513463 2.222661 1.418897
H  2.33618 0.053223 1.327232
H  1.206998 -0.995983 -1.341654
H  2.222702 2.952838 0.101489
H  0.630487 2.680515 -0.597894
H  1.001227 2.06905 1.011487
H  3.470607 1.831425 -1.832531
H  2.928229 0.269134 -2.421962
H  1.908694 1.691041 -2.64137
H  3.503924 -1.764115 -0.776927
H  6.033132 1.064203 0.808867
H  4.406192 1.078903 1.480268
H  5.657324 0.059241 2.191843
H  6.825586 -0.982896 -0.585607
H  6.521381 -2.028592 0.786629
H  5.735767 -2.360781 -0.757223
H  -2.279181 -1.177027 1.235262
H  -4.102348 -0.569875 -2.043231
H  -3.947514 1.180359 -1.940248
H  -2.543961 0.187437 -2.304551
H  -3.15304 0.744505 1.723927
H  -4.491392 2.456743 -0.463682
H  -3.606497 3.074169 0.910078
H  -3.929782 -4.270705 -1.053079
H  -6.18305 1.426439 1.094046
H  -5.287721 2.054219 2.472695
H  -6.052295 3.167215 1.344124
totalener: -851.99563322 hartree
nucrepener: 1531.75721402 hartree
electener: -2383.75284724 hartree
oneelecener: -4196.44770730 hartree
twoeener: 1812.69486005 hartree
kineticenergy: 848.02059043 hartree
xcener: -85.218432803839 hartree
chargesum: -0.0000000
charge: -0.267003 -0.392793 0.123557 -0.025619 -0.137240 -0.276803 -0.237597 -0.191686 0.364376 -0.026855 -0.234987 -0.212305 0.110218 -0.154368 -0.451821 -0.251719 -0.019582 -0.098372 0.208315 -0.245190 0.102825 0.078224 0.083887 0.087446 0.104333 0.086830 0.078918 0.091399 0.088106 0.083981 0.080780 0.092667 0.083753 0.086071 0.078263 0.109913 0.101007 0.084950 0.098630 0.092581 0.059081 0.073409 0.244855 0.083824 0.078858 0.082883
qa: -0.2670 -0.3928 0.1236 -0.0256 -0.1372 -0.2768 -0.2376 -0.1917 0.3644 -0.0269 -0.2350 -0.2123 0.1102 -0.1544 -0.4518 -0.2517 -0.0196 -0.0984 0.2083 -0.2452 0.1028 0.0782 0.0839 0.0874 0.1043 0.0868 0.0789 0.0914 0.0881 0.0840 0.0808 0.0927 0.0838 0.0861 0.0783 0.1099 0.1010 0.0850 0.0986 0.0926 0.0591 0.0734 0.2449 0.0838 0.0789 0.0829
va: 2.1280 2.1134 3.7009 3.8051 3.9370 3.9084 3.9037 3.8699 4.2309 3.7394 3.9440 3.9410 3.9199 3.8239 4.0011 3.9481 3.8048 3.9274 3.4630 3.9161 1.0262 1.0387 1.0020 1.0027 1.0207 1.0051 1.0084 1.0052 1.0147 1.0000 1.0112 1.0004 0.9986 0.9976 1.0111 1.0248 1.0005 1.0116 1.0076 1.0217 1.0172 1.0043 0.9718 1.0052 1.0054 1.0070
dispcorr: -0.020169269 hartree
energy: -852.015802492068
dipole: 8.51315 -8.33337 0.17978 13.60156 -13.31525 0.28632 -1.98001 1.44960 -0.53042
magnitude: 0.62900 au
magnitude: 1.59879 debye
