program: Orca
programVersion: 5.0.2
elementType: O O C C C C C C C C C C C C C C C C C C H H H H H H H H H H H H H H H H H H H H H H H H H H
charge: 0
multiplicity: 1
keywords: wb97x-d3
keywords: def2-TZVPP
keywords: def2/J RIJCOSX
keywords: DEFGRID2
keywords: scfconv7
keywords: smallprint printgap noloewdin
keywords: NOSOSCF
formula: C18H26O2
InChI: InChI=1/C18H26O2/c1-8-10-13(5)15(9-2)20-17(19)16-14(11-12(3)4)18(16,6)7/h2,10-11,14-16H,8H2,1,3-7H3
46 atoms
O  -0.820155 -0.717379 0.570865
O  -1.006005 0.980068 2.020797
C  2.07113 -0.892392 1.615127
C  2.002267 -0.288113 0.242479
C  1.156814 0.289728 1.361283
C  1.510758 -2.279805 1.821372
C  3.272355 -0.618193 2.489712
C  3.089384 0.524269 -0.333071
C  -0.322747 0.238201 1.3687
C  3.56486 0.463188 -1.579136
C  3.06897 -0.471472 -2.640638
C  4.674225 1.371445 -2.020161
C  -2.244906 -0.79021 0.430669
C  -2.689524 0.104603 -0.702447
C  -2.568813 -2.193595 0.194177
C  -2.16324 -0.249331 -2.05895
C  -3.466443 1.148036 -0.415053
C  -3.976292 2.1908 -1.35648
C  -2.867096 -3.338308 -0.002171
C  -3.190338 3.494478 -1.21813
H  1.443509 -0.885971 -0.467651
H  1.507333 1.222953 1.78858
H  1.119854 -2.394782 2.834342
H  0.714547 -2.530971 1.12574
H  2.306126 -3.01602 1.691264
H  4.096024 -1.284319 2.226968
H  3.637954 0.404127 2.406316
H  3.024843 -0.790253 3.538451
H  3.538551 1.255786 0.332331
H  2.647621 0.087398 -3.479787
H  3.893528 -1.062041 -3.04646
H  2.310133 -1.168873 -2.294171
H  4.9923 2.046384 -1.226612
H  5.547137 0.798265 -2.342884
H  4.369585 1.980805 -2.874911
H  -2.724985 -0.470799 1.359876
H  -1.072604 -0.203351 -2.077568
H  -2.443396 -1.266558 -2.338477
H  -2.529207 0.420516 -2.83329
H  -3.730245 1.305846 0.627124
H  -5.030313 2.380283 -1.136334
H  -3.940809 1.848054 -2.391348
H  -3.134164 -4.354623 -0.164965
H  -3.210111 3.862025 -0.191831
H  -2.145499 3.348129 -1.491273
H  -3.602858 4.273539 -1.859662
totalener: -851.99323497 hartree
nucrepener: 1566.46837165 hartree
electener: -2418.46160662 hartree
oneelecener: -4265.69353962 hartree
twoeener: 1847.23193300 hartree
kineticenergy: 848.02189259 hartree
xcener: -85.219825141477 hartree
chargesum: -0.0000000
charge: -0.278592 -0.364246 0.077700 0.085411 -0.101848 -0.251282 -0.252655 -0.202384 0.348966 -0.045789 -0.246353 -0.205129 0.096218 -0.145169 -0.468038 -0.252031 -0.008676 -0.117508 0.205394 -0.237010 0.072063 0.074367 0.090399 0.091701 0.083353 0.091471 0.071829 0.092672 0.071899 0.089181 0.086726 0.081461 0.077002 0.084365 0.083572 0.111361 0.092382 0.101932 0.085253 0.099160 0.070607 0.064661 0.246400 0.085067 0.081175 0.082961
qa: -0.2786 -0.3642 0.0777 0.0854 -0.1018 -0.2513 -0.2527 -0.2024 0.3490 -0.0458 -0.2464 -0.2051 0.0962 -0.1452 -0.4680 -0.2520 -0.0087 -0.1175 0.2054 -0.2370 0.0721 0.0744 0.0904 0.0917 0.0834 0.0915 0.0718 0.0927 0.0719 0.0892 0.0867 0.0815 0.0770 0.0844 0.0836 0.1114 0.0924 0.1019 0.0853 0.0992 0.0706 0.0647 0.2464 0.0851 0.0812 0.0830
va: 2.0968 2.1464 3.7453 3.7301 3.8695 3.9191 3.9267 3.9088 4.2645 3.8122 3.9469 3.9368 3.9738 3.7949 3.9556 3.9602 3.7894 3.9518 3.4678 3.9126 1.0312 1.0350 1.0028 1.0130 1.0017 1.0033 1.0115 1.0034 1.0220 0.9976 1.0005 1.0141 1.0124 0.9981 0.9980 1.0249 1.0000 1.0025 1.0124 1.0179 1.0065 1.0104 0.9713 1.0051 1.0050 1.0063
dispcorr: -0.020807304 hartree
energy: -852.014042276110
dipole: 11.41770 -11.01791 0.39979 5.94176 -6.29102 -0.34926 -11.08035 10.32148 -0.75886
magnitude: 0.92612 au
magnitude: 2.35400 debye
