program: Orca
programVersion: 5.0.2
elementType: O O C C C C C C C C C C C C C C C C C C H H H H H H H H H H H H H H H H H H H H H H H H H H
charge: 0
multiplicity: 1
keywords: wb97x-d3
keywords: def2-TZVPP
keywords: def2/J RIJCOSX
keywords: DEFGRID2
keywords: scfconv7
keywords: smallprint printgap noloewdin
keywords: NOSOSCF
formula: C18H26O2
InChI: InChI=1/C18H26O2/c1-8-10-13(5)15(9-2)20-17(19)16-14(11-12(3)4)18(16,6)7/h2,10-11,14-16H,8H2,1,3-7H3
46 atoms
O  -0.831407 -0.640178 0.591336
O  -1.023898 1.18481 1.876602
C  2.063412 -0.692418 1.638737
C  1.99838 -0.210043 0.217588
C  1.140839 0.454217 1.273569
C  1.511749 -2.059897 1.9651
C  3.261717 -0.332719 2.486104
C  3.08671 0.567397 -0.408972
C  -0.338254 0.390384 1.291874
C  3.719727 0.28489 -1.549529
C  3.440523 -0.915503 -2.401996
C  4.79621 1.188455 -2.073606
C  -2.258518 -0.755399 0.497737
C  -2.755321 0.022209 -0.698712
C  -2.553896 -2.181645 0.404915
C  -2.309854 -0.483056 -2.036152
C  -3.504122 1.102517 -0.480903
C  -4.048743 2.056204 -1.494468
C  -2.826076 -3.346819 0.325361
C  -3.295358 3.38566 -1.464504
H  1.456767 -0.873415 -0.44692
H  1.481863 1.425433 1.615991
H  2.313121 -2.798807 1.905857
H  1.116009 -2.086536 2.982561
H  0.720752 -2.379253 1.291685
H  3.628814 0.675074 2.298174
H  3.012182 -0.399005 3.546353
H  4.085227 -1.022369 2.292671
H  3.388751 1.468061 0.117913
H  3.130432 -0.615371 -3.406203
H  4.345947 -1.515181 -2.52438
H  2.670664 -1.569006 -1.997985
H  5.742967 0.653171 -2.181333
H  4.540286 1.570608 -3.065182
H  4.967672 2.043611 -1.420928
H  -2.720191 -0.361525 1.407487
H  -1.221905 -0.561391 -2.079853
H  -2.707454 -1.480579 -2.232691
H  -2.622138 0.166155 -2.850424
H  -3.713188 1.368392 0.551754
H  -5.105334 2.236662 -1.277579
H  -4.015033 1.635877 -2.500163
H  -3.071817 -4.379324 0.26022
H  -3.728001 4.099569 -2.165784
H  -3.323443 3.835124 -0.471431
H  -2.247477 3.243898 -1.728143
totalener: -851.99327851 hartree
nucrepener: 1562.23102809 hartree
electener: -2414.22430660 hartree
oneelecener: -4257.25507315 hartree
twoeener: 1843.03076655 hartree
kineticenergy: 848.01424596 hartree
xcener: -85.217984291080 hartree
chargesum: 0.0000000
charge: -0.275127 -0.366648 0.094399 0.078575 -0.124316 -0.257611 -0.243585 -0.208228 0.357672 -0.042232 -0.241460 -0.206660 0.089030 -0.145056 -0.464404 -0.256032 -0.009099 -0.115337 0.206126 -0.235927 0.075512 0.074072 0.082749 0.091105 0.091835 0.072241 0.093282 0.089679 0.074078 0.087154 0.085518 0.082108 0.083545 0.084537 0.077641 0.109406 0.095233 0.103252 0.085904 0.098715 0.070765 0.062310 0.246824 0.082805 0.084041 0.081613
qa: -0.2751 -0.3666 0.0944 0.0786 -0.1243 -0.2576 -0.2436 -0.2082 0.3577 -0.0422 -0.2415 -0.2067 0.0890 -0.1451 -0.4644 -0.2560 -0.0091 -0.1153 0.2061 -0.2359 0.0755 0.0741 0.0827 0.0911 0.0918 0.0722 0.0933 0.0897 0.0741 0.0872 0.0855 0.0821 0.0835 0.0845 0.0776 0.1094 0.0952 0.1033 0.0859 0.0987 0.0708 0.0623 0.2468 0.0828 0.0840 0.0816
va: 2.1013 2.1440 3.7303 3.7306 3.9058 3.9219 3.9199 3.8996 4.2506 3.8028 3.9494 3.9377 3.9733 3.7850 3.9422 3.9579 3.7917 3.9519 3.4671 3.9115 1.0289 1.0370 1.0023 1.0025 1.0129 1.0111 1.0038 1.0045 1.0205 0.9985 1.0000 1.0130 0.9983 0.9981 1.0121 1.0254 1.0019 1.0000 1.0118 1.0195 1.0061 1.0117 0.9710 1.0061 1.0054 1.0055
dispcorr: -0.020700628 hartree
energy: -852.013979138039
dipole: 11.69537 -11.27913 0.41625 4.57952 -5.02072 -0.44120 -11.04481 10.33575 -0.70906
magnitude: 0.93311 au
magnitude: 2.37177 debye
