program: Orca
programVersion: 5.0.2
elementType: O O C C C C C C C C C C C C C C C C C C H H H H H H H H H H H H H H H H H H H H H H H H H H
charge: 0
multiplicity: 1
keywords: wb97x-d3
keywords: def2-TZVPP
keywords: def2/J RIJCOSX
keywords: DEFGRID2
keywords: scfconv7
keywords: smallprint printgap noloewdin
keywords: NOSOSCF
formula: C18H26O2
InChI: InChI=1/C18H26O2/c1-8-10-13(5)15(9-2)20-17(19)16-14(11-12(3)4)18(16,6)7/h2,10-11,14-16H,8H2,1,3-7H3
46 atoms
O  -1.055836 -1.022569 -0.402105
O  -0.18777 -0.459898 1.584219
C  1.768682 1.175591 -0.261213
C  2.44768 -0.057135 0.256959
C  1.102148 -0.181067 -0.413132
C  1.239761 2.184029 0.729283
C  2.280821 1.805825 -1.533537
C  3.638762 -0.646598 -0.396656
C  -0.080318 -0.551942 0.391215
C  4.87772 -0.64724 0.097827
C  5.256911 -0.007639 1.398751
C  6.006252 -1.307956 -0.635141
C  -2.286322 -1.339489 0.233956
C  -3.133341 -0.113741 0.535627
C  -3.004733 -2.253424 -0.648757
C  -4.090571 -0.332598 1.663996
C  -3.002648 0.997141 -0.183269
C  -3.77346 2.270277 -0.037642
C  -3.635759 -2.997171 -1.345967
C  -4.700081 2.503988 -1.229672
H  2.403499 -0.165111 1.336193
H  1.095604 -0.576984 -1.423209
H  0.945532 1.737183 1.675486
H  2.00942 2.92993 0.936504
H  0.372348 2.710406 0.325164
H  3.13148 2.455341 -1.319614
H  2.610795 1.069951 -2.265652
H  1.504686 2.414742 -2.000469
H  3.475578 -1.129123 -1.35617
H  6.027133 0.751678 1.240337
H  4.421486 0.475164 1.901338
H  5.683528 -0.742822 2.085861
H  6.8047 -0.594835 -0.854931
H  6.454594 -2.100495 -0.030704
H  5.681853 -1.750116 -1.576363
H  -2.085622 -1.859771 1.178305
H  -4.771426 0.501848 1.811333
H  -4.699287 -1.223058 1.489582
H  -3.547721 -0.492493 2.598687
H  -2.27822 1.00093 -0.992805
H  -3.067308 3.102845 0.035019
H  -4.351959 2.286773 0.886516
H  -4.184949 -3.657413 -1.972828
H  -5.223733 3.456366 -1.142747
H  -4.144137 2.516468 -2.168046
H  -5.446639 1.713177 -1.302465
totalener: -851.99397092 hartree
nucrepener: 1542.10865016 hartree
electener: -2394.10262107 hartree
oneelecener: -4217.05333953 hartree
twoeener: 1822.95071845 hartree
kineticenergy: 848.01503325 hartree
xcener: -85.218523347419 hartree
chargesum: -0.0000000
charge: -0.274959 -0.380290 0.132338 0.001041 -0.128068 -0.265649 -0.231033 -0.196987 0.325115 -0.028668 -0.237490 -0.211172 0.088842 -0.031349 -0.476439 -0.262980 -0.111227 -0.104410 0.246619 -0.240752 0.096765 0.076601 0.103446 0.086304 0.080337 0.088141 0.074563 0.089869 0.082204 0.084464 0.081972 0.088746 0.083285 0.086333 0.078115 0.112445 0.080873 0.097617 0.104368 0.097492 0.067130 0.060058 0.242822 0.082723 0.076745 0.084100
qa: -0.2750 -0.3803 0.1323 0.0010 -0.1281 -0.2656 -0.2310 -0.1970 0.3251 -0.0287 -0.2375 -0.2112 0.0888 -0.0313 -0.4764 -0.2630 -0.1112 -0.1044 0.2466 -0.2408 0.0968 0.0766 0.1034 0.0863 0.0803 0.0881 0.0746 0.0899 0.0822 0.0845 0.0820 0.0887 0.0833 0.0863 0.0781 0.1124 0.0809 0.0976 0.1044 0.0975 0.0671 0.0601 0.2428 0.0827 0.0767 0.0841
va: 2.1188 2.1246 3.7076 3.7960 3.9283 3.9080 3.9032 3.8973 4.2497 3.7645 3.9491 3.9395 3.9386 3.7582 4.0655 3.9481 3.8541 3.9319 3.4099 3.9099 1.0296 1.0412 1.0211 1.0025 1.0043 1.0063 1.0095 1.0048 1.0171 0.9999 1.0121 0.9999 0.9986 0.9978 1.0115 1.0131 1.0121 0.9997 0.9995 1.0239 1.0076 1.0143 0.9728 1.0072 1.0051 1.0047
dispcorr: -0.020343608 hartree
energy: -852.014314525535
dipole: 8.26252 -8.10521 0.15730 14.13679 -13.79657 0.34022 -0.96180 0.57895 -0.38285
magnitude: 0.53579 au
magnitude: 1.36186 debye
