program: Orca
programVersion: 5.0.2
elementType: O O C C C C C C C C C C C C C C C C C C H H H H H H H H H H H H H H H H H H H H H H H H H H
charge: 0
multiplicity: 1
keywords: wb97x-d3
keywords: def2-TZVPP
keywords: def2/J RIJCOSX
keywords: DEFGRID2
keywords: scfconv7
keywords: smallprint printgap noloewdin
keywords: NOSOSCF
formula: C18H26O2
InChI: InChI=1/C18H26O2/c1-8-10-13(5)15(9-2)20-17(19)16-14(11-12(3)4)18(16,6)7/h2,10-11,14-16H,8H2,1,3-7H3
46 atoms
O  -0.808232 -0.78786 0.480907
O  -0.905819 0.699783 2.1523
C  2.07914 -1.267225 1.385417
C  2.027247 -0.390505 0.169905
C  1.218108 -0.018736 1.401883
C  1.46883 -2.646723 1.306919
C  3.294932 -1.232748 2.282901
C  3.145187 0.46862 -0.256843
C  -0.261332 0.014557 1.405439
C  3.48481 0.7797 -1.510227
C  2.764677 0.309161 -2.737497
C  4.66545 1.662692 -1.787916
C  -2.236173 -0.779556 0.35601
C  -2.664251 0.284061 -0.627907
C  -2.623168 -2.119046 -0.075908
C  -2.179543 0.107193 -2.033515
C  -3.402298 1.299163 -0.180904
C  -3.906092 2.470349 -0.961561
C  -2.981933 -3.20517 -0.435794
C  -3.084305 3.728102 -0.681477
H  1.43077 -0.805408 -0.633443
H  1.618383 0.790581 2.002402
H  2.23633 -3.364815 1.012074
H  1.0863 -2.95817 2.280889
H  0.656247 -2.721598 0.589719
H  3.045066 -1.619638 3.272101
H  4.091623 -1.855656 1.87253
H  3.697803 -0.230587 2.421619
H  3.749364 0.894442 0.538453
H  3.433926 -0.266877 -3.381137
H  1.896212 -0.311425 -2.528812
H  2.423251 1.161525 -3.33009
H  5.405057 1.145973 -2.404784
H  4.368417 2.556426 -2.342593
H  5.161381 1.986397 -0.873713
H  -2.690542 -0.580357 1.330589
H  -2.522209 -0.840274 -2.453368
H  -2.516653 0.904258 -2.691553
H  -1.088322 0.095379 -2.070128
H  -3.640922 1.318688 0.878924
H  -4.948261 2.653424 -0.686422
H  -3.909214 2.264467 -2.032655
H  -3.294569 -4.17239 -0.747844
H  -3.491607 4.589874 -1.210796
H  -3.072674 3.965647 0.382615
H  -2.049647 3.594543 -0.996852
totalener: -851.99299711 hartree
nucrepener: 1568.06080217 hartree
electener: -2420.05379928 hartree
oneelecener: -4268.86764459 hartree
twoeener: 1848.81384531 hartree
kineticenergy: 848.01814022 hartree
xcener: -85.219377361944 hartree
chargesum: -0.0000000
charge: -0.278651 -0.364621 0.078862 0.066833 -0.090986 -0.246512 -0.262919 -0.194570 0.347525 -0.046189 -0.239010 -0.206009 0.094871 -0.144069 -0.467500 -0.250071 -0.006672 -0.118386 0.205261 -0.237312 0.076566 0.076609 0.083119 0.089089 0.090361 0.092603 0.093365 0.074293 0.071746 0.088950 0.073648 0.086899 0.083768 0.084349 0.076886 0.110973 0.102772 0.085773 0.088529 0.099101 0.071178 0.064260 0.246184 0.082454 0.085362 0.081288
qa: -0.2787 -0.3646 0.0789 0.0668 -0.0910 -0.2465 -0.2629 -0.1946 0.3475 -0.0462 -0.2390 -0.2060 0.0949 -0.1441 -0.4675 -0.2501 -0.0067 -0.1184 0.2053 -0.2373 0.0766 0.0766 0.0831 0.0891 0.0904 0.0926 0.0934 0.0743 0.0717 0.0890 0.0736 0.0869 0.0838 0.0843 0.0769 0.1110 0.1028 0.0858 0.0885 0.0991 0.0712 0.0643 0.2462 0.0825 0.0854 0.0813
va: 2.0959 2.1467 3.7440 3.7507 3.8437 3.9162 3.9290 3.9141 4.2722 3.8226 3.9469 3.9365 3.9761 3.7948 3.9503 3.9610 3.7885 3.9534 3.4679 3.9130 1.0260 1.0331 1.0014 1.0029 1.0139 1.0035 1.0024 1.0111 1.0224 0.9999 1.0165 0.9985 0.9975 0.9984 1.0122 1.0249 1.0022 1.0123 1.0013 1.0179 1.0062 1.0101 0.9715 1.0062 1.0050 1.0049
dispcorr: -0.020878238 hartree
energy: -852.013875347673
dipole: 10.94738 -10.59176 0.35562 7.64988 -7.89013 -0.24025 -10.53761 9.72943 -0.80818
magnitude: 0.91506 au
magnitude: 2.32590 debye
