program: Orca
programVersion: 5.0.2
elementType: O O C C C C C C C C C C C C C C C C C C H H H H H H H H H H H H H H H H H H H H H H H H H H
charge: 0
multiplicity: 1
keywords: wb97x-d3
keywords: def2-TZVPP
keywords: def2/J RIJCOSX
keywords: DEFGRID2
keywords: scfconv7
keywords: smallprint printgap noloewdin
keywords: NOSOSCF
formula: C18H26O2
InChI: InChI=1/C18H26O2/c1-8-10-13(5)15(9-2)20-17(19)16-14(11-12(3)4)18(16,6)7/h2,10-11,14-16H,8H2,1,3-7H3
46 atoms
O  -0.781228 -1.029582 -0.154509
O  -0.201812 0.355032 1.511411
C  1.694586 1.469843 -0.737697
C  2.475318 0.685588 0.26333
C  1.250225 0.062466 -0.365721
C  0.901922 2.669477 -0.277932
C  2.248329 1.622274 -2.134478
C  3.831457 0.162841 -0.047388
C  0.038439 -0.158422 0.450508
C  4.296435 -1.044466 0.276576
C  3.492651 -2.07218 1.013185
C  5.691777 -1.461832 -0.078236
C  -2.067419 -1.242501 0.44495
C  -3.038933 -0.195978 -0.052348
C  -2.475658 -2.597213 0.089794
C  -3.349613 -0.242225 -1.516504
C  -3.509954 0.692035 0.822507
C  -4.426296 1.843469 0.562308
C  -2.84695 -3.70444 -0.181436
C  -3.711073 3.179227 0.760669
H  2.322302 0.997537 1.294043
H  1.42409 -0.688323 -1.128276
H  0.544074 2.575353 0.744096
H  1.526784 3.563002 -0.330507
H  0.036651 2.836231 -0.922887
H  2.795243 0.739706 -2.465674
H  1.442283 1.801299 -2.848034
H  2.929682 2.474127 -2.187637
H  4.500722 0.846936 -0.562333
H  2.502374 -1.720663 1.291739
H  3.374336 -2.977997 0.413079
H  4.007312 -2.373478 1.928844
H  6.227117 -0.684912 -0.622718
H  6.26947 -1.704327 0.81697
H  5.685795 -2.362874 -0.696877
H  -1.984238 -1.176166 1.533389
H  -2.434214 -0.212946 -2.109803
H  -3.865051 -1.168195 -1.778103
H  -3.975436 0.587686 -1.83566
H  -3.166741 0.613201 1.850677
H  -5.271533 1.783839 1.25439
H  -4.853845 1.798711 -0.439795
H  -3.165134 -4.690566 -0.419865
H  -4.394066 4.016796 0.617958
H  -3.291801 3.259092 1.764137
H  -2.888117 3.289089 0.05424
totalener: -851.99499728 hartree
nucrepener: 1564.84911533 hartree
electener: -2416.84411261 hartree
oneelecener: -4262.64131258 hartree
twoeener: 1845.79719997 hartree
kineticenergy: 848.01430192 hartree
xcener: -85.217693350877 hartree
chargesum: -0.0000000
charge: -0.264142 -0.387935 0.126145 -0.004351 -0.142552 -0.264919 -0.271880 -0.246882 0.346874 -0.006967 -0.222922 -0.211193 0.109823 -0.153334 -0.454665 -0.253008 -0.022015 -0.106906 0.212907 -0.234883 0.106137 0.092727 0.102725 0.086315 0.082220 0.087115 0.089997 0.089360 0.092396 0.085821 0.087461 0.090653 0.078167 0.087361 0.084259 0.109517 0.097399 0.103327 0.084645 0.095234 0.071257 0.060934 0.244617 0.084549 0.082615 0.075997
qa: -0.2641 -0.3879 0.1261 -0.0044 -0.1426 -0.2649 -0.2719 -0.2469 0.3469 -0.0070 -0.2229 -0.2112 0.1098 -0.1533 -0.4547 -0.2530 -0.0220 -0.1069 0.2129 -0.2349 0.1061 0.0927 0.1027 0.0863 0.0822 0.0871 0.0900 0.0894 0.0924 0.0858 0.0875 0.0907 0.0782 0.0874 0.0843 0.1095 0.0974 0.1033 0.0846 0.0952 0.0713 0.0609 0.2446 0.0845 0.0826 0.0760
va: 2.1198 2.1165 3.7344 3.8107 3.8532 3.9035 3.9063 3.8991 4.2035 3.7432 3.9383 3.9414 3.9238 3.8073 4.0048 3.9486 3.8015 3.9429 3.4573 3.9133 1.0258 1.0301 1.0204 1.0036 1.0015 1.0056 1.0065 1.0019 1.0102 1.0166 1.0013 1.0016 1.0099 0.9987 0.9994 1.0235 1.0081 1.0001 1.0106 1.0201 1.0057 1.0137 0.9719 1.0071 1.0055 1.0065
dispcorr: -0.021220629 hartree
energy: -852.016217907720
dipole: 6.19950 -6.15111 0.04839 10.99676 -10.98747 0.00929 -5.21487 4.63757 -0.57731
magnitude: 0.57941 au
magnitude: 1.47273 debye
