program: Orca
programVersion: 5.0.2
elementType: O O C C C C C C C C C C C C C C C C C C H H H H H H H H H H H H H H H H H H H H H H H H H H
charge: 0
multiplicity: 1
keywords: wb97x-d3
keywords: def2-TZVPP
keywords: def2/J RIJCOSX
keywords: DEFGRID2
keywords: scfconv7
keywords: smallprint printgap noloewdin
keywords: NOSOSCF
formula: C18H26O2
InChI: InChI=1/C18H26O2/c1-8-10-13(5)15(9-2)20-17(19)16-14(11-12(3)4)18(16,6)7/h2,10-11,14-16H,8H2,1,3-7H3
46 atoms
O  -1.10624 -1.158945 -0.395515
O  -0.287825 -0.406349 1.54972
C  1.639619 1.113473 -0.433962
C  2.356416 -0.018731 0.24068
C  1.037527 -0.282054 -0.440301
C  1.041376 2.203078 0.420829
C  2.156793 1.614034 -1.760822
C  3.593755 -0.612801 -0.314919
C  -0.154397 -0.603584 0.372451
C  4.817507 -0.490392 0.202045
C  5.128415 0.299561 1.436989
C  5.999148 -1.153031 -0.4395
C  -2.345798 -1.445256 0.23449
C  -3.251565 -0.231157 0.355021
C  -2.999565 -2.488537 -0.551253
C  -4.327506 -0.418151 1.378249
C  -3.066086 0.847685 -0.400211
C  -3.858358 2.116772 -0.377181
C  -3.576957 -3.34219 -1.163683
C  -3.058456 3.274813 0.217295
H  2.287521 -0.002791 1.323864
H  1.07366 -0.790181 -1.398232
H  1.776424 2.996476 0.568606
H  0.171203 2.649475 -0.065556
H  0.729338 1.851092 1.400857
H  2.959274 2.337747 -1.607406
H  2.556135 0.816542 -2.385994
H  1.362006 2.109438 -2.321157
H  3.483634 -1.201773 -1.221074
H  5.864934 1.076748 1.217902
H  4.257035 0.788381 1.867217
H  5.571102 -0.337429 2.206829
H  5.721959 -1.710993 -1.333058
H  6.755842 -0.417092 -0.723137
H  6.484196 -1.847023 0.251628
H  -2.162255 -1.836528 1.242734
H  -3.892004 -0.497373 2.377375
H  -5.043284 0.399402 1.393831
H  -4.88551 -1.339581 1.197482
H  -2.237931 0.848247 -1.10271
H  -4.790783 1.997812 0.175551
H  -4.145808 2.36957 -1.401905
H  -4.081412 -4.097794 -1.715941
H  -2.785966 3.06846 1.25212
H  -2.134162 3.445059 -0.336966
H  -3.63088 4.202495 0.194976
totalener: -851.99400170 hartree
nucrepener: 1553.25024380 hartree
electener: -2405.24424550 hartree
oneelecener: -4239.29226865 hartree
twoeener: 1834.04802315 hartree
kineticenergy: 848.01145669 hartree
xcener: -85.218978759381 hartree
chargesum: -0.0000000
charge: -0.273864 -0.377409 0.136263 -0.001532 -0.128419 -0.264307 -0.233524 -0.196422 0.318455 -0.028629 -0.237337 -0.210535 0.099378 -0.043070 -0.475854 -0.261357 -0.111123 -0.101468 0.245383 -0.254683 0.096957 0.077381 0.088892 0.072915 0.103840 0.088344 0.076045 0.090189 0.081865 0.083887 0.082080 0.089406 0.078089 0.083246 0.086306 0.111026 0.100917 0.082059 0.099224 0.099117 0.061917 0.069225 0.243356 0.091733 0.072647 0.089387
qa: -0.2739 -0.3774 0.1363 -0.0015 -0.1284 -0.2643 -0.2335 -0.1964 0.3185 -0.0286 -0.2373 -0.2105 0.0994 -0.0431 -0.4759 -0.2614 -0.1111 -0.1015 0.2454 -0.2547 0.0970 0.0774 0.0889 0.0729 0.1038 0.0883 0.0760 0.0902 0.0819 0.0839 0.0821 0.0894 0.0781 0.0832 0.0863 0.1110 0.1009 0.0821 0.0992 0.0991 0.0619 0.0692 0.2434 0.0917 0.0726 0.0894
va: 2.1198 2.1259 3.6998 3.8011 3.9310 3.9044 3.9042 3.8973 4.2526 3.7638 3.9486 3.9393 3.9257 3.7722 4.0401 3.9454 3.8478 3.9195 3.4135 3.9120 1.0297 1.0407 1.0049 1.0090 1.0208 1.0064 1.0094 1.0045 1.0171 0.9999 1.0122 0.9997 1.0117 0.9985 0.9978 1.0154 0.9987 1.0131 1.0018 1.0220 1.0155 1.0056 0.9725 1.0035 1.0044 1.0083
dispcorr: -0.021045118 hartree
energy: -852.015046818413
dipole: 10.31179 -10.15543 0.15636 16.11642 -15.79360 0.32281 0.36552 -0.76259 -0.39707
magnitude: 0.53509 au
magnitude: 1.36009 debye
