program: Orca
programVersion: 5.0.2
elementType: O O O O N C C C C C C C C C C C C C C C C C C C C C C C C H H H H H H H H H H H H H H H H H H H H H H H H H
charge: 0
multiplicity: 1
keywords: wb97x-d3
keywords: def2-TZVPP
keywords: def2/J RIJCOSX
keywords: DEFGRID2
keywords: scfconv7
keywords: smallprint printgap noloewdin
keywords: NOSOSCF
formula: C24H25NO4
InChI: InChI=1/C24H25NO4/c1-23(2)19(21-24(3,4)29-21)20(23)22(26)28-18(14-25)15-9-8-12-17(13-15)27-16-10-6-5-7-11-16/h5-13,18-21H,1-4H3
54 atoms
O  -2.440612 2.559906 -2.154628
O  -1.709013 -1.650115 1.085788
O  -1.123825 0.503432 1.207903
O  3.204201 -0.048046 -1.360696
N  -0.496597 -4.41693 2.425076
C  -3.546433 1.108342 -0.478161
C  -4.178783 1.051767 0.866394
C  -3.301256 -0.106302 0.412111
C  -2.431166 2.043832 -0.824278
C  -1.373838 1.686233 -1.770895
C  -3.753365 1.965832 1.987251
C  -5.653903 0.728268 0.907878
C  -1.953267 -0.332236 0.943027
C  -0.022968 2.333761 -1.640428
C  -1.35952 0.340063 -2.44195
C  -0.366511 -2.019443 1.394865
C  0.492182 -2.002131 0.153056
C  -0.456126 -3.363562 1.9650
C  1.490308 -1.043741 0.034355
C  0.227983 -2.888113 -0.884075
C  2.234462 -0.981499 -1.138126
C  0.978182 -2.810963 -2.047383
C  1.98063 -1.863967 -2.180843
C  3.74999 0.639267 -0.298607
C  4.482883 -0.028626 0.67281
C  3.595544 2.015525 -0.260577
C  5.064408 0.700468 1.699535
C  4.191566 2.734792 0.767309
C  4.921266 2.081683 1.750444
H  -4.200887 0.886712 -1.314934
H  -3.828032 -1.010846 0.134254
H  -2.18849 2.794792 -0.075083
H  -2.705236 2.250394 1.968922
H  -4.341902 2.883944 1.946929
H  -3.950103 1.49305 2.9507
H  -5.922828 0.254624 1.853436
H  -5.946884 0.056137 0.100741
H  -6.244552 1.641023 0.812108
H  0.640812 1.691038 -1.060846
H  -0.078785 3.298964 -1.136446
H  0.436918 2.48302 -2.619181
H  -0.744582 -0.357338 -1.87136
H  -0.92002 0.417351 -3.438285
H  -2.353122 -0.093579 -2.544982
H  0.058577 -1.373286 2.168537
H  1.669398 -0.353512 0.848771
H  -0.553243 -3.63278 -0.792969
H  0.783316 -3.497045 -2.860487
H  2.564482 -1.805139 -3.090476
H  4.601355 -1.104138 0.627193
H  3.022458 2.519414 -1.028712
H  5.636979 0.185067 2.459208
H  4.076898 3.810203 0.799294
H  5.379715 2.645678 2.551655
elementType: O N C H
totalener: -1285.31859629 hartree
nucrepener: 2802.20124874 hartree
electener: -4087.51984503 hartree
oneelecener: -7318.27734800 hartree
twoeener: 3230.75750297 hartree
cpcmener: -0.04022094 hartree
kineticenergy: 1279.66667623 hartree
xcener: -124.707708407108 hartree
chargesum: -0.0000000
charge: -0.482816 -0.282786 -0.471564 -0.332781 -0.101988 -0.090521 0.086155 -0.079143 0.104241 0.235152 -0.288946 -0.258968 0.372711 -0.243641 -0.226444 0.422731 -0.005463 -0.220928 -0.164461 -0.217880 0.282544 -0.115799 -0.248343 0.251533 -0.176980 -0.214507 -0.151114 -0.151101 -0.165993 0.107773 0.094688 0.122645 0.092166 0.103680 0.103104 0.097284 0.090301 0.096861 0.047162 0.101631 0.106917 0.012571 0.113439 0.107847 0.138217 0.140398 0.143585 0.160564 0.147718 0.158814 0.163234 0.162937 0.161286 0.162274
qa: -0.4828 -0.2828 -0.4716 -0.3328 -0.1020 -0.0905 0.0862 -0.0791 0.1042 0.2352 -0.2889 -0.2590 0.3727 -0.2436 -0.2264 0.4227 -0.0055 -0.2209 -0.1645 -0.2179 0.2825 -0.1158 -0.2483 0.2515 -0.1770 -0.2145 -0.1511 -0.1511 -0.1660 0.1078 0.0947 0.1226 0.0922 0.1037 0.1031 0.0973 0.0903 0.0969 0.0472 0.1016 0.1069 0.0126 0.1134 0.1078 0.1382 0.1404 0.1436 0.1606 0.1477 0.1588 0.1632 0.1629 0.1613 0.1623
va: 1.9210 2.1300 2.0199 2.0549 3.1113 3.8295 3.8130 3.8703 3.9143 3.7777 3.9005 3.8941 4.1021 3.9512 3.9442 3.7243 3.6337 4.0700 3.8279 3.9407 3.6683 3.8933 4.0056 3.7111 3.9329 3.9706 3.8830 3.9090 3.8902 1.0202 1.0306 0.9974 1.0180 0.9983 0.9997 1.0021 1.0046 1.0019 1.0101 1.0094 1.0031 1.0352 1.0058 1.0071 1.0187 1.0195 1.0092 0.9888 1.0075 0.9966 0.9954 0.9889 0.9903 0.9888
dispcorr: -0.032525095 hartree
energy: -1285.351121382213
dipole: -14.50219 14.48050 -0.02168 15.08053 -14.44513 0.63540 -2.86680 2.96041 0.09362
magnitude: 0.64262 au
magnitude: 1.63342 debye
