program: Orca
programVersion: 5.0.2
elementType: O O O O N C C C C C C C C C C C C C C C C C C C C C C C C H H H H H H H H H H H H H H H H H H H H H H H H H
charge: 0
multiplicity: 1
keywords: wb97x-d3
keywords: def2-TZVPP
keywords: def2/J RIJCOSX
keywords: DEFGRID2
keywords: scfconv7
keywords: smallprint printgap noloewdin
keywords: NOSOSCF
formula: C24H25NO4
InChI: InChI=1/C24H25NO4/c1-23(2)19(21-24(3,4)29-21)20(23)22(26)28-18(14-25)15-9-8-12-17(13-15)27-16-10-6-5-7-11-16/h5-13,18-21H,1-4H3
54 atoms
O  -2.240582 3.448932 -0.092917
O  -1.811043 -1.904345 -0.202283
O  -2.536894 -0.445291 1.327618
O  3.316784 -1.121842 -0.669524
N  -0.68647 -5.005301 -0.077466
C  -3.278758 1.376133 -0.961907
C  -4.473708 0.490314 -0.939592
C  -3.08616 -0.135683 -0.985318
C  -2.852574 2.197367 0.213961
C  -1.448409 2.443195 0.546186
C  -5.347509 0.371636 0.283969
C  -5.254871 0.363233 -2.225978
C  -2.484175 -0.799491 0.175251
C  -1.073674 2.733563 1.97359
C  -0.335935 1.868324 -0.286946
C  -1.069811 -2.578545 0.812386
C  0.240242 -1.882268 1.088925
C  -0.859597 -3.932132 0.297289
C  1.197054 -1.789873 0.083929
C  0.456465 -1.281624 2.320383
C  2.379766 -1.110975 0.327805
C  1.642685 -0.596751 2.546576
C  2.610515 -0.50807 1.559595
C  4.083686 -0.005984 -0.905341
C  3.540139 1.271965 -0.909478
C  5.422749 -0.209928 -1.203961
C  4.356509 2.353112 -1.208695
C  6.225103 0.880324 -1.510881
C  5.699352 2.164807 -1.508393
H  -3.053796 1.838885 -1.917432
H  -2.799221 -0.561303 -1.93906
H  -3.567523 2.258023 1.032701
H  -6.120045 1.141648 0.251494
H  -5.850538 -0.596344 0.293023
H  -4.823112 0.47777 1.229192
H  -4.613373 0.449254 -3.103235
H  -6.011255 1.14768 -2.287631
H  -5.767335 -0.598749 -2.277261
H  -1.914392 3.127647 2.544853
H  -0.257318 3.45656 2.022346
H  -0.732663 1.820746 2.464136
H  -0.63632 1.654896 -1.311816
H  0.030534 0.941964 0.158454
H  0.503417 2.565994 -0.320898
H  -1.651906 -2.673158 1.734156
H  1.036455 -2.248278 -0.885401
H  -0.290557 -1.349518 3.100175
H  1.820061 -0.131084 3.506557
H  3.536887 0.016174 1.756306
H  2.492105 1.429157 -0.688621
H  5.831404 -1.212274 -1.200696
H  3.933532 3.348968 -1.211237
H  7.269318 0.720637 -1.745067
H  6.329048 3.012173 -1.743698
elementType: O N C H
totalener: -1285.31860798 hartree
nucrepener: 2755.68759954 hartree
electener: -4041.00620752 hartree
oneelecener: -7225.02866862 hartree
twoeener: 3184.02246110 hartree
cpcmener: -0.04097841 hartree
kineticenergy: 1279.66315581 hartree
xcener: -124.706160807133 hartree
chargesum: -0.0000000
charge: -0.482363 -0.284132 -0.470973 -0.338929 -0.101360 -0.082191 0.091020 -0.091729 0.091217 0.249204 -0.291406 -0.259341 0.381799 -0.267205 -0.245003 0.436810 0.007476 -0.226230 -0.214573 -0.198432 0.233668 -0.137841 -0.164147 0.194948 -0.112780 -0.198314 -0.216359 -0.156472 -0.148221 0.108751 0.095407 0.122975 0.104453 0.102965 0.092399 0.090796 0.096624 0.097150 0.097330 0.103006 0.085706 0.110568 0.017593 0.116746 0.139786 0.136304 0.148642 0.164616 0.159337 0.182118 0.148399 0.157957 0.160724 0.161504
qa: -0.4824 -0.2841 -0.4710 -0.3389 -0.1014 -0.0822 0.0910 -0.0917 0.0912 0.2492 -0.2914 -0.2593 0.3818 -0.2672 -0.2450 0.4368 0.0075 -0.2262 -0.2146 -0.1984 0.2337 -0.1378 -0.1641 0.1949 -0.1128 -0.1983 -0.2164 -0.1565 -0.1482 0.1088 0.0954 0.1230 0.1045 0.1030 0.0924 0.0908 0.0966 0.0972 0.0973 0.1030 0.0857 0.1106 0.0176 0.1167 0.1398 0.1363 0.1486 0.1646 0.1593 0.1821 0.1484 0.1580 0.1607 0.1615
va: 1.9161 2.1325 2.0231 2.0669 3.1117 3.8222 3.8014 3.8699 3.9388 3.7159 3.9037 3.8942 4.0931 3.9479 3.9493 3.7132 3.5922 4.0796 4.0219 3.9018 3.7911 3.8739 3.8938 3.7633 3.8101 3.9557 3.9565 3.9052 3.8638 1.0204 1.0306 0.9953 0.9981 0.9997 1.0173 1.0046 1.0016 1.0021 1.0076 1.0029 1.0053 1.0038 1.0338 1.0009 1.0159 1.0242 1.0081 0.9891 0.9940 0.9628 1.0065 0.9942 0.9886 0.9889
dispcorr: -0.031419344 hartree
energy: -1285.350027321868
dipole: -14.30126 14.29248 -0.00878 19.13366 -17.86577 1.26789 -0.45077 0.92110 0.47033
magnitude: 1.35235 au
magnitude: 3.43739 debye
