program: Orca
programVersion: 5.0.2
elementType: O O O O N C C C C C C C C C C C C C C C C C C C C C C C C H H H H H H H H H H H H H H H H H H H H H H H H H
charge: 0
multiplicity: 1
keywords: wb97x-d3
keywords: def2-TZVPP
keywords: def2/J RIJCOSX
keywords: DEFGRID2
keywords: scfconv7
keywords: smallprint printgap noloewdin
keywords: NOSOSCF
formula: C24H25NO4
InChI: InChI=1/C24H25NO4/c1-23(2)19(21-24(3,4)29-21)20(23)22(26)28-18(14-25)15-9-8-12-17(13-15)27-16-10-6-5-7-11-16/h5-13,18-21H,1-4H3
54 atoms
O  -2.667599 3.243904 -1.037918
O  -1.864975 -1.940327 0.182407
O  -2.58502 -0.190205 1.367029
O  2.854178 -0.285316 -0.866066
N  -0.273356 -4.757755 0.819084
C  -3.602052 0.953969 -1.24319
C  -4.744589 0.078535 -0.867345
C  -3.338654 -0.506659 -0.889195
C  -3.079091 2.051172 -0.371754
C  -1.670545 2.447569 -0.388297
C  -5.501031 0.263476 0.423953
C  -5.629625 -0.401455 -1.993847
C  -2.596689 -0.819756 0.337351
C  -1.061566 3.048698 0.84805
C  -0.688193 1.763159 -1.299562
C  -1.003006 -2.287877 1.262781
C  0.202852 -1.381487 1.334915
C  -0.603414 -3.670828 0.999593
C  1.043198 -1.271672 0.234618
C  0.440514 -0.635534 2.480028
C  2.11325 -0.390303 0.277089
C  1.51833 0.237046 2.510249
C  2.352291 0.377074 1.412001
C  4.171338 0.105779 -0.806555
C  4.585682 1.083373 -1.697849
C  5.072505 -0.496258 0.062287
C  5.921318 1.461209 -1.720838
C  6.401096 -0.098265 0.038459
C  6.831684 0.87856 -0.850549
H  -3.492073 1.151805 -2.304463
H  -3.119246 -1.163252 -1.722095
H  -3.636194 2.243755 0.542591
H  -5.93576 -0.684826 0.74335
H  -4.907212 0.647433 1.248299
H  -6.323847 0.961671 0.261761
H  -5.072403 -0.53627 -2.921432
H  -6.424852 0.321324 -2.184168
H  -6.097973 -1.3543 -1.742102
H  -1.812139 3.507059 1.492311
H  -0.32005 3.806912 0.589854
H  -0.552318 2.274056 1.423961
H  -1.14385 1.401096 -2.219897
H  -0.236822 0.91143 -0.789485
H  0.120532 2.444958 -1.569586
H  -1.538981 -2.28074 2.21683
H  0.86755 -1.853212 -0.663433
H  -0.214981 -0.72672 3.336116
H  1.70447 0.831849 3.394157
H  3.173045 1.081329 1.448219
H  3.870965 1.540137 -2.370577
H  4.748375 -1.268357 0.748853
H  6.246049 2.221854 -2.418463
H  7.104677 -0.563585 0.716223
H  7.870245 1.18056 -0.866186
elementType: O N C H
totalener: -1285.31795391 hartree
nucrepener: 2739.72898516 hartree
electener: -4025.04693907 hartree
oneelecener: -7193.50923351 hartree
twoeener: 3168.46229445 hartree
cpcmener: -0.04109067 hartree
kineticenergy: 1279.66309069 hartree
xcener: -124.706472209356 hartree
chargesum: 0.0000000
charge: -0.480126 -0.285841 -0.469746 -0.340424 -0.101539 -0.099393 0.079748 -0.059896 0.118218 0.217695 -0.285975 -0.259622 0.361405 -0.256191 -0.260831 0.445120 0.006708 -0.226005 -0.236254 -0.190255 0.259657 -0.151739 -0.165753 0.270234 -0.239400 -0.190855 -0.131856 -0.151122 -0.177309 0.108294 0.094060 0.123713 0.103163 0.092777 0.103189 0.090447 0.097318 0.097794 0.097386 0.102788 0.076380 0.104744 0.053074 0.111281 0.140838 0.136735 0.148088 0.163586 0.159388 0.149851 0.159979 0.161394 0.163069 0.162008
qa: -0.4801 -0.2858 -0.4697 -0.3404 -0.1015 -0.0994 0.0797 -0.0599 0.1182 0.2177 -0.2860 -0.2596 0.3614 -0.2562 -0.2608 0.4451 0.0067 -0.2260 -0.2363 -0.1903 0.2597 -0.1517 -0.1658 0.2702 -0.2394 -0.1909 -0.1319 -0.1511 -0.1773 0.1083 0.0941 0.1237 0.1032 0.0928 0.1032 0.0904 0.0973 0.0978 0.0974 0.1028 0.0764 0.1047 0.0531 0.1113 0.1408 0.1367 0.1481 0.1636 0.1594 0.1499 0.1600 0.1614 0.1631 0.1620
va: 1.9249 2.1318 2.0244 2.0415 3.1120 3.8233 3.8249 3.8632 3.9044 3.7694 3.8973 3.8930 4.1045 3.9401 3.9413 3.7129 3.5934 4.0842 3.9910 3.9204 3.6994 3.8994 3.8770 3.6929 4.0005 3.9187 3.8831 3.8846 3.8913 1.0190 1.0305 0.9981 0.9993 1.0191 0.9987 1.0046 1.0018 1.0021 1.0093 1.0046 1.0079 1.0074 1.0252 1.0048 1.0144 1.0277 1.0056 0.9905 0.9946 1.0058 0.9959 0.9886 0.9891 0.9890
dispcorr: -0.030825812 hartree
energy: -1285.348779719357
dipole: -14.15764 14.41096 0.25331 15.30704 -14.45906 0.84798 -3.58353 4.06592 0.48239
magnitude: 1.00794 au
magnitude: 2.56198 debye
