program: Orca
programVersion: 5.0.2
elementType: O O O O N C C C C C C C C C C C C C C C C C C C C C C C C H H H H H H H H H H H H H H H H H H H H H H H H H
charge: 0
multiplicity: 1
keywords: wb97x-d3
keywords: def2-TZVPP
keywords: def2/J RIJCOSX
keywords: DEFGRID2
keywords: scfconv7
keywords: smallprint printgap noloewdin
keywords: NOSOSCF
formula: C24H25NO4
InChI: InChI=1/C24H25NO4/c1-23(2)19(21-24(3,4)29-21)20(23)22(26)28-18(14-25)15-9-8-12-17(13-15)27-16-10-6-5-7-11-16/h5-13,18-21H,1-4H3
54 atoms
O  -2.058561 3.337495 -1.264243
O  -1.672998 -1.715948 0.624003
O  -1.246523 0.315769 1.470891
O  3.277184 -0.552089 -1.512242
N  -1.096551 -4.44961 2.415256
C  -3.338219 1.397948 -0.404432
C  -4.215983 0.899589 0.688171
C  -3.170815 -0.034057 0.089099
C  -2.271967 2.424937 -0.187816
C  -1.008704 2.424929 -0.925807
C  -4.091612 1.412521 2.101153
C  -5.639516 0.557055 0.318458
C  -1.948641 -0.407713 0.808165
C  0.204294 3.049311 -0.293048
C  -0.710329 1.369672 -1.955602
C  -0.467654 -2.231099 1.186686
C  0.566127 -2.433759 0.106982
C  -0.82869 -3.478315 1.86064
C  1.448457 -1.388596 -0.149679
C  0.607927 -3.598258 -0.646731
C  2.38983 -1.526361 -1.160814
C  1.551933 -3.718625 -1.656987
C  2.444968 -2.693869 -1.914739
C  3.566736 0.495975 -0.670265
C  3.955518 0.291414 0.647693
C  3.528232 1.771309 -1.212001
C  4.289243 1.387262 1.429993
C  3.882665 2.857178 -0.422656
C  4.254383 2.671477 0.901078
H  -3.795095 1.447845 -1.387553
H  -3.558654 -0.808217 -0.561481
H  -2.269376 2.905189 0.788939
H  -4.723468 2.294079 2.221472
H  -4.445535 0.658374 2.805651
H  -3.084434 1.691493 2.397132
H  -5.717605 0.187262 -0.704234
H  -6.27512 1.440278 0.40361
H  -6.041638 -0.208173 0.984362
H  0.830066 3.535281 -1.043596
H  0.808836 2.282479 0.193503
H  -0.06626 3.79053 0.459381
H  -0.103292 1.787466 -2.761268
H  -1.609097 0.942658 -2.398257
H  -0.135757 0.557188 -1.507875
H  -0.076197 -1.559609 1.955459
H  1.390277 -0.48405 0.442397
H  -0.078627 -4.412505 -0.452936
H  1.597587 -4.624457 -2.246077
H  3.184147 -2.792396 -2.69947
H  4.001091 -0.707445 1.062893
H  3.226367 1.912942 -2.241995
H  4.587568 1.231515 2.458356
H  3.855076 3.852658 -0.845747
H  4.522126 3.520103 1.516093
elementType: O N C H
totalener: -1285.31781795 hartree
nucrepener: 2788.06696629 hartree
electener: -4073.38478424 hartree
oneelecener: -7289.75338186 hartree
twoeener: 3216.36859762 hartree
cpcmener: -0.03942545 hartree
kineticenergy: 1279.65742254 hartree
xcener: -124.706077745391 hartree
chargesum: 0.0000000
charge: -0.482399 -0.285110 -0.469748 -0.331074 -0.103117 -0.089151 0.085761 -0.098387 0.111697 0.243713 -0.288788 -0.257475 0.399872 -0.269609 -0.283804 0.407664 -0.006003 -0.212343 -0.236526 -0.217434 0.350350 -0.112371 -0.256359 0.321507 -0.222414 -0.254996 -0.134236 -0.144101 -0.171241 0.108636 0.094732 0.122855 0.104934 0.102987 0.091451 0.090330 0.096823 0.097251 0.102409 0.067496 0.103238 0.112167 0.107286 0.079203 0.134422 0.143235 0.139731 0.162900 0.148461 0.160667 0.147925 0.163093 0.161670 0.162222
qa: -0.4824 -0.2851 -0.4697 -0.3311 -0.1031 -0.0892 0.0858 -0.0984 0.1117 0.2437 -0.2888 -0.2575 0.3999 -0.2696 -0.2838 0.4077 -0.0060 -0.2123 -0.2365 -0.2174 0.3504 -0.1124 -0.2564 0.3215 -0.2224 -0.2550 -0.1342 -0.1441 -0.1712 0.1086 0.0947 0.1229 0.1049 0.1030 0.0915 0.0903 0.0968 0.0973 0.1024 0.0675 0.1032 0.1122 0.1073 0.0792 0.1344 0.1432 0.1397 0.1629 0.1485 0.1607 0.1479 0.1631 0.1617 0.1622
va: 1.9199 2.1168 2.0247 2.0748 3.1097 3.8268 3.8103 3.8699 3.9071 3.7395 3.9034 3.8938 4.0759 3.9701 3.9603 3.7167 3.7448 4.0747 3.8793 3.9993 3.6370 3.9083 4.0221 3.6063 3.9284 3.9516 3.8741 3.8413 3.8864 1.0199 1.0311 0.9965 0.9982 0.9997 1.0178 1.0046 1.0018 1.0021 0.9985 1.0034 1.0098 1.0041 1.0050 1.0013 1.0301 1.0046 1.0109 0.9880 1.0068 0.9956 1.0096 0.9884 0.9891 0.9886
dispcorr: -0.031829048 hartree
energy: -1285.349646995250
dipole: -13.34670 13.56789 0.22119 17.51029 -17.01922 0.49107 -1.33794 0.86664 -0.47129
magnitude: 0.71567 au
magnitude: 1.81910 debye
