program: Orca
programVersion: 5.0.2
elementType: O O O O N C C C C C C C C C C C C C C C C C C C C C C C C H H H H H H H H H H H H H H H H H H H H H H H H H
charge: 0
multiplicity: 1
keywords: wb97x-d3
keywords: def2-TZVPP
keywords: def2/J RIJCOSX
keywords: DEFGRID2
keywords: scfconv7
keywords: smallprint printgap noloewdin
keywords: NOSOSCF
formula: C24H25NO4
InChI: InChI=1/C24H25NO4/c1-23(2)19(21-24(3,4)29-21)20(23)22(26)28-18(14-25)15-9-8-12-17(13-15)27-16-10-6-5-7-11-16/h5-13,18-21H,1-4H3
54 atoms
O  -2.733684 3.503789 -0.199133
O  -1.27957 -1.664831 -0.332012
O  -2.5230 -0.482533 1.096294
O  3.191228 0.86192 0.579122
N  0.669391 -4.322008 -0.187546
C  -3.212593 1.3076 -1.248394
C  -4.231228 0.235442 -1.407824
C  -2.763845 -0.149933 -1.267297
C  -3.065857 2.129464 -0.007491
C  -1.769542 2.650759 0.427541
C  -5.237314 -0.07538 -0.327789
C  -4.7916 0.033012 -2.7964
C  -2.220891 -0.745356 -0.041926
C  -1.532575 2.903723 1.890575
C  -0.522727 2.3826 -0.369928
C  -0.609299 -2.256459 0.776545
C  0.363702 -1.307176 1.436252
C  0.094607 -3.413225 0.220733
C  1.359162 -0.709325 0.672045
C  0.233516 -1.014424 2.785897
C  2.229035 0.186418 1.277203
C  1.10934 -0.113456 3.37451
C  2.10867 0.487939 2.627792
C  3.854247 0.249297 -0.457313
C  4.088236 1.007227 -1.594786
C  4.333367 -1.050673 -0.355625
C  4.810622 0.455241 -2.643644
C  5.04307 -1.593149 -1.417242
C  5.284545 -0.846584 -2.563236
H  -2.943502 1.838175 -2.155961
H  -2.279648 -0.484253 -2.176664
H  -3.820014 1.975111 0.761358
H  -5.554645 -1.116854 -0.398973
H  -4.884246 0.091355 0.685576
H  -6.122291 0.546469 -0.472408
H  -4.055308 0.253266 -3.569868
H  -5.649993 0.687359 -2.957083
H  -5.126524 -0.996326 -2.934641
H  -2.463691 3.065403 2.43406
H  -0.893656 3.776324 2.038019
H  -1.025772 2.046819 2.338146
H  -0.718685 2.247393 -1.432481
H  -0.030692 1.482132 -0.001463
H  0.184822 3.206693 -0.259295
H  -1.323517 -2.636726 1.513992
H  1.444309 -0.930962 -0.385843
H  -0.54683 -1.481823 3.371997
H  1.014534 0.122981 4.425642
H  2.791309 1.192114 3.085751
H  3.711132 2.019984 -1.657133
H  4.161443 -1.637246 0.538003
H  4.993912 1.047013 -3.530733
H  5.417044 -2.60553 -1.340473
H  5.842056 -1.275318 -3.385072
elementType: O N C H
totalener: -1285.31787861 hartree
nucrepener: 2779.35251313 hartree
electener: -4064.67039174 hartree
oneelecener: -7272.79807112 hartree
twoeener: 3208.12767939 hartree
cpcmener: -0.04104203 hartree
kineticenergy: 1279.66395356 hartree
xcener: -124.706497021217 hartree
chargesum: 0.0000000
charge: -0.479878 -0.288039 -0.466999 -0.341804 -0.101753 -0.099014 0.082197 -0.066384 0.117447 0.219562 -0.286671 -0.258678 0.362317 -0.254180 -0.263138 0.448964 0.007176 -0.226763 -0.176662 -0.192610 0.233260 -0.133383 -0.222467 0.291571 -0.254503 -0.194491 -0.123677 -0.146809 -0.186930 0.108552 0.094110 0.122406 0.103167 0.092700 0.103188 0.090669 0.097187 0.097364 0.096547 0.102975 0.075388 0.105463 0.054001 0.112058 0.140843 0.153070 0.148472 0.161424 0.150469 0.148648 0.157593 0.161667 0.162710 0.161670
qa: -0.4799 -0.2880 -0.4670 -0.3418 -0.1018 -0.0990 0.0822 -0.0664 0.1174 0.2196 -0.2867 -0.2587 0.3623 -0.2542 -0.2631 0.4490 0.0072 -0.2268 -0.1767 -0.1926 0.2333 -0.1334 -0.2225 0.2916 -0.2545 -0.1945 -0.1237 -0.1468 -0.1869 0.1086 0.0941 0.1224 0.1032 0.0927 0.1032 0.0907 0.0972 0.0974 0.0965 0.1030 0.0754 0.1055 0.0540 0.1121 0.1408 0.1531 0.1485 0.1614 0.1505 0.1486 0.1576 0.1617 0.1627 0.1617
va: 1.9236 2.1303 2.0272 2.0443 3.1103 3.8223 3.8190 3.8629 3.9070 3.7703 3.8971 3.8928 4.1099 3.9431 3.9383 3.7200 3.5858 4.0873 3.8652 3.9185 3.6944 3.8898 3.9822 3.6769 4.0048 3.9076 3.8775 3.8859 3.8995 1.0191 1.0304 0.9984 0.9994 1.0191 0.9985 1.0045 1.0019 1.0023 1.0090 1.0046 1.0070 1.0065 1.0264 1.0052 1.0159 1.0138 1.0047 0.9890 1.0041 1.0073 0.9978 0.9882 0.9891 0.9892
dispcorr: -0.031301103 hartree
energy: -1285.349179711807
dipole: -16.65959 16.27476 -0.38483 11.88192 -11.86450 0.01742 -4.99414 5.00999 0.01585
magnitude: 0.38555 au
magnitude: 0.97999 debye
