program: Orca
programVersion: 5.0.2
elementType: O O O O N C C C C C C C C C C C C C C C C C C C C C C C C H H H H H H H H H H H H H H H H H H H H H H H H H
charge: 0
multiplicity: 1
keywords: wb97x-d3
keywords: def2-TZVPP
keywords: def2/J RIJCOSX
keywords: DEFGRID2
keywords: scfconv7
keywords: smallprint printgap noloewdin
keywords: NOSOSCF
formula: C24H25NO4
InChI: InChI=1/C24H25NO4/c1-23(2)19(21-24(3,4)29-21)20(23)22(26)28-18(14-25)15-9-8-12-17(13-15)27-16-10-6-5-7-11-16/h5-13,18-21H,1-4H3
54 atoms
O  -0.978614 2.851409 -1.196657
O  -1.508357 -1.08485 0.237023
O  -3.564193 -1.761676 -0.288193
O  3.535062 -0.558691 0.754524
N  -0.923473 -2.67215 -2.689012
C  -2.525767 1.70205 0.33977
C  -2.702235 1.22966 1.74112
C  -3.295869 0.412828 0.600497
C  -1.216407 1.706891 -0.383881
C  -1.131973 1.586052 -1.842276
C  -1.540251 0.744035 2.574359
C  -3.738643 1.951121 2.572845
C  -2.833306 -0.905451 0.14477
C  0.120847 1.049394 -2.477731
C  -2.375101 1.409817 -2.672149
C  -0.982476 -2.359546 -0.091025
C  0.405973 -2.457713 0.492896
C  -0.962344 -2.52691 -1.549794
C  1.31999 -1.425387 0.293378
C  0.743359 -3.571867 1.243025
C  2.574468 -1.511854 0.877978
C  2.011837 -3.652361 1.805943
C  2.923855 -2.628959 1.6351
C  3.257845 0.64455 0.149699
C  3.824762 0.903319 -1.08793
C  2.4900 1.600924 0.799906
C  3.628357 2.144528 -1.678785
C  2.28998 2.832992 0.192563
C  2.859014 3.109135 -1.044055
H  -3.176301 2.517092 0.038536
H  -4.370848 0.493939 0.491127
H  -0.346485 1.396385 0.191705
H  -0.709124 0.332342 2.009433
H  -1.149288 1.580061 3.157596
H  -1.868408 -0.019924 3.281382
H  -3.298777 2.825179 3.057181
H  -4.132365 1.299922 3.355682
H  -4.580949 2.294788 1.971024
H  0.357853 1.605273 -3.387916
H  -0.007906 0.004387 -2.759412
H  0.979582 1.116648 -1.811266
H  -2.578929 0.347438 -2.818031
H  -2.240565 1.852944 -3.661167
H  -3.257152 1.862333 -2.221538
H  -1.605689 -3.160489 0.317603
H  1.047568 -0.566509 -0.305797
H  0.025995 -4.367997 1.395536
H  2.285709 -4.517518 2.395132
H  3.907243 -2.685743 2.084807
H  4.423776 0.145681 -1.5774
H  2.058892 1.390394 1.771309
H  4.074032 2.351283 -2.643163
H  1.689739 3.581554 0.693043
H  2.700873 4.072356 -1.510943
elementType: O N C H
totalener: -1285.32606518 hartree
nucrepener: 2891.87827343 hartree
electener: -4177.20433861 hartree
oneelecener: -7497.12638127 hartree
twoeener: 3319.92204266 hartree
cpcmener: -0.03661466 hartree
kineticenergy: 1279.68061735 hartree
xcener: -124.711613965043 hartree
chargesum: 0.0000000
charge: -0.464963 -0.263499 -0.443634 -0.323406 -0.090355 -0.098065 0.099248 -0.123935 0.200991 0.205401 -0.257930 -0.263454 0.395017 -0.222131 -0.278072 0.364329 0.011140 -0.223574 -0.193037 -0.190326 0.307932 -0.105061 -0.254196 0.253028 -0.172794 -0.174139 -0.148656 -0.160744 -0.157145 0.101472 0.092238 0.066076 0.064781 0.100812 0.106708 0.095328 0.097702 0.089229 0.116357 0.101669 0.008162 0.091373 0.106750 0.096844 0.129976 0.079967 0.144665 0.158155 0.145512 0.146896 0.159877 0.156099 0.158972 0.156411
qa: -0.4650 -0.2635 -0.4436 -0.3234 -0.0904 -0.0981 0.0992 -0.1239 0.2010 0.2054 -0.2579 -0.2635 0.3950 -0.2221 -0.2781 0.3643 0.0111 -0.2236 -0.1930 -0.1903 0.3079 -0.1051 -0.2542 0.2530 -0.1728 -0.1741 -0.1487 -0.1607 -0.1571 0.1015 0.0922 0.0661 0.0648 0.1008 0.1067 0.0953 0.0977 0.0892 0.1164 0.1017 0.0082 0.0914 0.1068 0.0968 0.1300 0.0800 0.1447 0.1582 0.1455 0.1469 0.1599 0.1561 0.1590 0.1564
va: 1.9350 2.1455 2.0655 2.1021 3.0857 3.8499 3.8059 3.9081 3.8066 3.7896 3.9173 3.9038 4.1284 3.9431 3.9678 3.7961 3.7148 3.9919 3.9095 3.9401 3.7496 3.9092 3.9959 3.7037 3.9494 3.8591 3.8703 3.8343 3.8409 1.0205 1.0289 0.9923 1.0032 1.0019 1.0016 1.0021 1.0015 1.0054 1.0090 1.0198 1.0149 1.0069 1.0023 1.0030 1.0266 1.0388 1.0007 0.9892 1.0093 1.0032 0.9945 0.9909 0.9931 0.9919
dispcorr: -0.036025793 hartree
energy: -1285.362090974330
dipole: -9.13568 9.54624 0.41057 15.14815 -14.72834 0.41981 3.89697 -1.67549 2.22148
magnitude: 2.29778 au
magnitude: 5.84049 debye
