program: Orca
programVersion: 5.0.2
elementType: O O O O N C C C C C C C C C C C C C C C C C C C C C C C C H H H H H H H H H H H H H H H H H H H H H H H H H
charge: 0
multiplicity: 1
keywords: wb97x-d3
keywords: def2-TZVPP
keywords: def2/J RIJCOSX
keywords: DEFGRID2
keywords: scfconv7
keywords: smallprint printgap noloewdin
keywords: NOSOSCF
formula: C24H25NO4
InChI: InChI=1/C24H25NO4/c1-23(2)19(21-24(3,4)29-21)20(23)22(26)28-18(14-25)15-9-8-12-17(13-15)27-16-10-6-5-7-11-16/h5-13,18-21H,1-4H3
54 atoms
O  -4.196381 2.338659 -1.462008
O  -1.374285 -1.678148 0.734456
O  -0.934619 -0.212238 -0.88761
O  3.565125 -0.844162 1.447126
N  -1.788194 -2.988847 -2.390582
C  -2.85314 1.676045 0.505172
C  -1.618064 1.920085 1.297087
C  -2.101159 0.4891 1.093833
C  -2.941199 1.873771 -0.975676
C  -3.773307 1.02658 -1.833171
C  -0.338154 2.403395 0.663186
C  -1.798428 2.442413 2.703592
C  -1.410957 -0.44015 0.194719
C  -3.399172 0.856621 -3.280279
C  -4.583093 -0.105093 -1.258924
C  -0.755778 -2.708261 -0.000849
C  0.760543 -2.637738 -0.042915
C  -1.330103 -2.820592 -1.350437
C  1.464168 -1.711747 0.71057
C  1.447093 -3.589919 -0.791098
C  2.853788 -1.729362 0.68335
C  2.831303 -3.604343 -0.791578
C  3.54726 -2.666595 -0.060928
C  3.441109 0.496443 1.205698
C  3.668782 1.345104 2.281977
C  3.153292 1.010853 -0.052879
C  3.616345 2.71757 2.092644
C  3.101403 2.387837 -0.224413
C  3.330715 3.246731 0.840751
H  -3.787002 1.876116 1.02129
H  -2.551806 0.018005 1.959117
H  -2.086888 2.361943 -1.441572
H  -0.182315 2.069311 -0.358839
H  -0.324603 3.49506 0.655435
H  0.516875 2.071144 1.253932
H  -1.833857 3.533575 2.7020
H  -0.966642 2.138862 3.34181
H  -2.720519 2.081117 3.160655
H  -2.798278 1.689489 -3.646714
H  -4.28953 0.77777 -3.907548
H  -2.820873 -0.059004 -3.414606
H  -4.030053 -1.043014 -1.329619
H  -5.507454 -0.234796 -1.825921
H  -4.85227 0.050701 -0.215057
H  -1.04106 -3.625443 0.523478
H  0.966277 -0.982212 1.337417
H  0.906829 -4.329431 -1.369828
H  3.359718 -4.348783 -1.372032
H  4.629709 -2.667221 -0.063862
H  3.892091 0.93029 3.257037
H  2.977301 0.356931 -0.897653
H  3.796009 3.375363 2.933295
H  2.87754 2.787571 -1.205109
H  3.286798 4.318287 0.697501
elementType: O N C H
totalener: -1285.32626526 hartree
nucrepener: 2815.31467912 hartree
electener: -4100.64094438 hartree
oneelecener: -7345.07102552 hartree
twoeener: 3244.43008115 hartree
cpcmener: -0.03608245 hartree
kineticenergy: 1279.67296456 hartree
xcener: -124.710142013825 hartree
chargesum: 0.0000000
charge: -0.456368 -0.292666 -0.428114 -0.330781 -0.105215 -0.097530 0.118306 -0.071656 0.092713 0.221167 -0.298535 -0.259466 0.341106 -0.250433 -0.280991 0.497069 -0.021390 -0.240252 -0.190246 -0.218473 0.226664 -0.124497 -0.198309 0.279832 -0.237444 -0.181935 -0.112384 -0.162820 -0.195645 0.108989 0.093260 0.120120 0.096956 0.109922 0.073756 0.097159 0.097185 0.090927 0.091226 0.099345 0.082493 0.086656 0.108602 0.099031 0.156736 0.147457 0.141843 0.159479 0.148934 0.145186 0.151307 0.157288 0.158517 0.155919
qa: -0.4564 -0.2927 -0.4281 -0.3308 -0.1052 -0.0975 0.1183 -0.0717 0.0927 0.2212 -0.2985 -0.2595 0.3411 -0.2504 -0.2810 0.4971 -0.0214 -0.2403 -0.1902 -0.2185 0.2267 -0.1245 -0.1983 0.2798 -0.2374 -0.1819 -0.1124 -0.1628 -0.1956 0.1090 0.0933 0.1201 0.0970 0.1099 0.0738 0.0972 0.0972 0.0909 0.0912 0.0993 0.0825 0.0867 0.1086 0.0990 0.1567 0.1475 0.1418 0.1595 0.1489 0.1452 0.1513 0.1573 0.1585 0.1559
va: 1.9490 2.1279 2.0499 2.0703 3.0839 3.8583 3.8045 3.8691 3.9402 3.7803 3.8990 3.8914 4.0672 3.9452 3.9653 3.7788 3.7244 4.0549 3.9785 3.9829 3.7867 3.8983 4.0105 3.6768 3.9905 3.8346 3.8764 3.8484 3.8734 1.0176 1.0314 0.9969 1.0138 1.0011 1.0034 1.0019 1.0019 1.0049 1.0076 1.0038 1.0100 1.0086 1.0037 1.0028 0.9893 1.0067 1.0082 0.9901 1.0031 1.0088 1.0026 0.9886 0.9919 0.9919
dispcorr: -0.032409040 hartree
energy: -1285.358674299418
dipole: -11.32205 12.23115 0.90910 16.12267 -16.52468 -0.40201 1.12798 1.00350 2.13148
magnitude: 2.35187 au
magnitude: 5.97798 debye
