program: Orca
programVersion: 5.0.2
elementType: O O O O N C C C C C C C C C C C C C C C C C C C C C C C C H H H H H H H H H H H H H H H H H H H H H H H H H
charge: 0
multiplicity: 1
keywords: wb97x-d3
keywords: def2-TZVPP
keywords: def2/J RIJCOSX
keywords: DEFGRID2
keywords: scfconv7
keywords: smallprint printgap noloewdin
keywords: NOSOSCF
formula: C24H25NO4
InChI: InChI=1/C24H25NO4/c1-23(2)19(21-24(3,4)29-21)20(23)22(26)28-18(14-25)15-9-8-12-17(13-15)27-16-10-6-5-7-11-16/h5-13,18-21H,1-4H3
54 atoms
O  -2.62198 3.275066 -0.972056
O  -1.87393 -1.931641 0.129098
O  -2.549548 -0.215138 1.384204
O  2.826361 -0.216343 -0.850085
N  -0.288023 -4.778411 0.581178
C  -3.608173 1.009873 -1.181999
C  -4.757151 0.152085 -0.783545
C  -3.365352 -0.461497 -0.860354
C  -3.028873 2.080225 -0.312448
C  -1.61416 2.45047 -0.383846
C  -5.468001 0.332024 0.534667
C  -5.68853 -0.288146 -1.889077
C  -2.590767 -0.811726 0.337925
C  -0.939843 3.014597 0.836196
C  -0.685904 1.765598 -1.350868
C  -1.010179 -2.340488 1.184098
C  0.206364 -1.452821 1.305592
C  -0.618533 -3.708952 0.837019
C  1.025714 -1.260249 0.201207
C  0.48175 -0.812966 2.505311
C  2.11473 -0.405243 0.294583
C  1.578243 0.03241 2.587033
C  2.392907 0.253722 1.487488
C  4.141819 0.164912 -0.809677
C  4.528315 1.200587 -1.646997
C  5.072944 -0.498436 -0.020118
C  5.863687 1.576122 -1.69468
C  6.401656 -0.102718 -0.067145
C  6.803311 0.932109 -0.902274
H  -3.53082 1.226521 -2.242706
H  -3.186496 -1.109402 -1.710095
H  -3.542052 2.263083 0.629398
H  -6.271789 1.0616 0.416184
H  -5.925639 -0.608642 0.847176
H  -4.835756 0.674062 1.349126
H  -6.472862 0.455478 -2.043847
H  -6.171882 -1.234619 -1.639702
H  -5.166343 -0.420553 -2.8377
H  -1.651682 3.478496 1.519814
H  -0.193015 3.762317 0.561308
H  -0.424487 2.219635 1.378383
H  0.132461 2.43142 -1.633438
H  -1.18529 1.44618 -2.264638
H  -0.239752 0.885208 -0.886566
H  -1.544067 -2.383055 2.139347
H  0.82144 -1.757537 -0.740649
H  -0.158061 -0.963694 3.365074
H  1.794885 0.543837 3.515599
H  3.228446 0.936986 1.567827
H  3.790297 1.702354 -2.260595
H  4.771215 -1.316504 0.622506
H  6.166001 2.381831 -2.351285
H  7.128536 -0.615622 0.549598
H  7.842555 1.231443 -0.937241
elementType: O N C H
totalener: -1285.32815142 hartree
nucrepener: 2739.38237695 hartree
electener: -4024.71052837 hartree
oneelecener: -7192.74065360 hartree
twoeener: 3168.03012523 hartree
cpcmener: -0.03452812 hartree
kineticenergy: 1279.67339010 hartree
xcener: -124.706171863806 hartree
chargesum: -0.0000000
charge: -0.456791 -0.281252 -0.444180 -0.328078 -0.086908 -0.104165 0.078871 -0.057713 0.123208 0.209860 -0.286075 -0.258679 0.339311 -0.246835 -0.269536 0.432974 0.011822 -0.232250 -0.245581 -0.182766 0.258940 -0.144227 -0.174166 0.267950 -0.236089 -0.194545 -0.127791 -0.145855 -0.174672 0.106093 0.092449 0.117912 0.102461 0.101347 0.093888 0.096970 0.097257 0.088863 0.094768 0.100259 0.070123 0.109343 0.103565 0.063050 0.137480 0.138618 0.143250 0.159867 0.156846 0.147250 0.157901 0.157967 0.159337 0.158356
qa: -0.4568 -0.2813 -0.4442 -0.3281 -0.0869 -0.1042 0.0789 -0.0577 0.1232 0.2099 -0.2861 -0.2587 0.3393 -0.2468 -0.2695 0.4330 0.0118 -0.2322 -0.2456 -0.1828 0.2589 -0.1442 -0.1742 0.2680 -0.2361 -0.1945 -0.1278 -0.1459 -0.1747 0.1061 0.0924 0.1179 0.1025 0.1013 0.0939 0.0970 0.0973 0.0889 0.0948 0.1003 0.0701 0.1093 0.1036 0.0630 0.1375 0.1386 0.1432 0.1599 0.1568 0.1473 0.1579 0.1580 0.1593 0.1584
va: 1.9554 2.1314 2.0537 2.0543 3.1140 3.8169 3.8244 3.8544 3.9217 3.7954 3.8974 3.8939 4.1357 3.9400 3.9444 3.7296 3.5907 4.0822 3.9882 3.9378 3.7142 3.9087 3.8840 3.7094 4.0017 3.9263 3.8888 3.8896 3.8988 1.0192 1.0302 0.9990 0.9988 0.9996 1.0199 1.0019 1.0023 1.0047 1.0100 1.0051 1.0087 1.0045 1.0079 1.0173 1.0149 1.0276 1.0064 0.9914 0.9961 1.0065 0.9969 0.9898 0.9902 0.9903
dispcorr: -0.030682573 hartree
energy: -1285.358833993140
dipole: -13.99767 14.23889 0.24122 15.39286 -14.57428 0.81857 -3.05306 3.58392 0.53086
magnitude: 1.00502 au
magnitude: 2.55456 debye
