program: Orca
programVersion: 5.0.2
elementType: O O O O N C C C C C C C C C C C C C C C C C C C C C C C C H H H H H H H H H H H H H H H H H H H H H H H H H
charge: 0
multiplicity: 1
keywords: wb97x-d3
keywords: def2-TZVPP
keywords: def2/J RIJCOSX
keywords: DEFGRID2
keywords: scfconv7
keywords: smallprint printgap noloewdin
keywords: NOSOSCF
formula: C24H25NO4
InChI: InChI=1/C24H25NO4/c1-23(2)19(21-24(3,4)29-21)20(23)22(26)28-18(14-25)15-9-8-12-17(13-15)27-16-10-6-5-7-11-16/h5-13,18-21H,1-4H3
54 atoms
O  -2.355377 2.854949 -1.681829
O  -2.164088 -1.920513 0.704599
O  -1.888385 0.152485 1.493524
O  2.800085 0.588767 0.537821
N  -1.135391 -4.899482 1.682542
C  -3.741565 1.045882 -0.724582
C  -4.73129 0.691906 0.328107
C  -3.660686 -0.321189 -0.049628
C  -2.678843 2.081679 -0.529551
C  -1.354603 1.987796 -1.146799
C  -4.729272 1.3723 1.67427
C  -6.12137 0.333293 -0.142558
C  -2.50305 -0.620344 0.802795
C  -0.192614 2.678937 -0.486241
C  -0.985034 0.807609 -2.002824
C  -0.950501 -2.317398 1.340638
C  0.241049 -1.949384 0.489743
C  -1.065768 -3.764302 1.523665
C  1.073847 -0.925337 0.909929
C  0.448581 -2.562725 -0.74188
C  2.101463 -0.486436 0.083794
C  1.488076 -2.127525 -1.547236
C  2.313347 -1.082393 -1.152254
C  4.084079 0.841239 0.137041
C  4.390033 2.15244 -0.197112
C  5.066582 -0.140569 0.140839
C  5.696846 2.486905 -0.52092
C  6.366699 0.206259 -0.197455
C  6.688977 1.516302 -0.526152
H  -4.099477 0.986087 -1.747493
H  -4.001403 -1.160175 -0.644371
H  -2.756462 2.673289 0.380976
H  -5.312462 2.293532 1.617734
H  -5.202339 0.731524 2.420477
H  -3.742948 1.63319 2.047175
H  -6.608611 -0.349201 0.556206
H  -6.111275 -0.143481 -1.123526
H  -6.739596 1.230188 -0.218117
H  -0.512186 3.55227 0.083406
H  0.543053 3.004642 -1.224815
H  0.31018 1.998624 0.201898
H  -0.258425 1.099146 -2.764021
H  -1.843204 0.368773 -2.510512
H  -0.522203 0.030898 -1.393779
H  -0.859416 -1.872672 2.336275
H  0.916687 -0.445032 1.867808
H  -0.194874 -3.36611 -1.079537
H  1.653037 -2.594968 -2.509159
H  3.100449 -0.741029 -1.812299
H  3.610972 2.90504 -0.19165
H  4.829951 -1.161979 0.412312
H  5.935947 3.512205 -0.772271
H  7.135084 -0.556106 -0.192465
H  7.707627 1.779271 -0.779009
elementType: O N C H
totalener: -1285.32832237 hartree
nucrepener: 2754.24172229 hartree
electener: -4039.57004465 hartree
oneelecener: -7222.32897854 hartree
twoeener: 3182.75893388 hartree
cpcmener: -0.03327557 hartree
kineticenergy: 1279.68032866 hartree
xcener: -124.708644140375 hartree
chargesum: -0.0000000
charge: -0.458004 -0.276534 -0.447691 -0.322635 -0.087984 -0.093108 0.097059 -0.093123 0.105894 0.230680 -0.293376 -0.257244 0.362306 -0.277406 -0.223827 0.401823 0.049053 -0.225391 -0.260679 -0.203766 0.300933 -0.129810 -0.198773 0.283120 -0.248252 -0.202316 -0.119651 -0.142796 -0.179942 0.105260 0.093615 0.117102 0.103710 0.100257 0.094534 0.096870 0.088411 0.096354 0.098783 0.101810 0.082572 0.111821 0.107514 0.007984 0.134088 0.132145 0.141987 0.159934 0.156197 0.149223 0.156674 0.157973 0.158938 0.157685
qa: -0.4580 -0.2765 -0.4477 -0.3226 -0.0880 -0.0931 0.0971 -0.0931 0.1059 0.2307 -0.2934 -0.2572 0.3623 -0.2774 -0.2238 0.4018 0.0491 -0.2254 -0.2607 -0.2038 0.3009 -0.1298 -0.1988 0.2831 -0.2483 -0.2023 -0.1197 -0.1428 -0.1799 0.1053 0.0936 0.1171 0.1037 0.1003 0.0945 0.0969 0.0884 0.0964 0.0988 0.1018 0.0826 0.1118 0.1075 0.0080 0.1341 0.1321 0.1420 0.1599 0.1562 0.1492 0.1567 0.1580 0.1589 0.1577
va: 1.9514 2.1311 2.0488 2.0543 3.1136 3.8265 3.7973 3.8826 3.9301 3.7669 3.9027 3.8938 4.1193 3.9483 3.9324 3.7582 3.5643 4.0638 3.9851 3.9470 3.6639 3.9115 3.9254 3.7020 3.9960 3.9337 3.8873 3.8898 3.9052 1.0214 1.0309 0.9969 0.9978 1.0003 1.0183 1.0025 1.0047 1.0019 1.0122 1.0014 1.0090 1.0052 1.0087 1.0351 1.0180 1.0283 1.0102 0.9911 0.9983 1.0051 0.9980 0.9901 0.9901 0.9905
dispcorr: -0.031712459 hartree
energy: -1285.360034826494
dipole: -12.29262 12.79262 0.49999 14.65780 -14.10669 0.55111 -6.75277 6.11284 -0.63993
magnitude: 0.98144 au
magnitude: 2.49463 debye
