program: Orca
programVersion: 5.0.2
elementType: O O O O N C C C C C C C C C C C C C C C C C C C C C C C C H H H H H H H H H H H H H H H H H H H H H H H H H
charge: 0
multiplicity: 1
keywords: wb97x-d3
keywords: def2-TZVPP
keywords: def2/J RIJCOSX
keywords: DEFGRID2
keywords: scfconv7
keywords: smallprint printgap noloewdin
keywords: NOSOSCF
formula: C24H25NO4
InChI: InChI=1/C24H25NO4/c1-23(2)19(21-24(3,4)29-21)20(23)22(26)28-18(14-25)15-9-8-12-17(13-15)27-16-10-6-5-7-11-16/h5-13,18-21H,1-4H3
54 atoms
O  -2.381598 3.105597 -1.72761
O  -1.686376 -1.682341 0.785753
O  -1.125125 0.446258 1.181678
O  3.364475 -0.445783 -1.372264
N  -0.879493 -4.364471 2.525994
C  -3.490927 1.289378 -0.467481
C  -4.200296 0.910913 0.78526
C  -3.223696 -0.073919 0.15166
C  -2.435797 2.349943 -0.520777
C  -1.27016 2.269327 -1.401866
C  -3.886403 1.577151 2.101709
C  -5.653819 0.521241 0.658072
C  -1.916993 -0.356492 0.756811
C  -0.011636 2.996898 -1.014691
C  -1.058461 1.084951 -2.305946
C  -0.420897 -2.116182 1.278772
C  0.564853 -2.268885 0.146813
C  -0.682391 -3.382666 1.964572
C  1.530184 -1.283334 -0.028361
C  0.465902 -3.332199 -0.741226
C  2.411692 -1.376033 -1.098703
C  1.352722 -3.409839 -1.804917
C  2.325439 -2.441714 -1.987805
C  3.73399 0.479617 -0.428765
C  4.299529 0.086843 0.776966
C  3.582611 1.820984 -0.742831
C  4.707197 1.058094 1.679379
C  4.004075 2.783274 0.165259
C  4.560299 2.406471 1.379137
H  -4.082916 1.227134 -1.375293
H  -3.676439 -0.923355 -0.345797
H  -2.332891 2.958628 0.376369
H  -2.845461 1.863424 2.226843
H  -4.48874 2.481402 2.206597
H  -4.145914 0.914515 2.929319
H  -5.9463 -0.168091 1.452437
H  -5.865743 0.039294 -0.29728
H  -6.29171 1.404278 0.732578
H  0.511112 3.374105 -1.896019
H  0.667507 2.322137 -0.4922
H  -0.215109 3.84084 -0.354632
H  -0.400621 0.355585 -1.830452
H  -0.574036 1.397103 -3.233644
H  -1.987357 0.580229 -2.568772
H  -0.030637 -1.423941 2.030551
H  1.581793 -0.456549 0.668288
H  -0.286751 -4.10012 -0.610298
H  1.290577 -4.237915 -2.498574
H  3.017978 -2.506599 -2.817769
H  4.424565 -0.963694 1.009532
H  3.146481 2.108236 -1.691368
H  5.147867 0.756354 2.620717
H  3.889245 3.831403 -0.079082
H  4.883149 3.158935 2.086478
elementType: O N C H
totalener: -1285.32841684 hartree
nucrepener: 2777.06315386 hartree
electener: -4062.39157070 hartree
oneelecener: -7267.90596240 hartree
twoeener: 3205.51439170 hartree
cpcmener: -0.03300431 hartree
kineticenergy: 1279.68073337 hartree
xcener: -124.706640061782 hartree
chargesum: 0.0000000
charge: -0.458232 -0.277724 -0.452575 -0.320719 -0.089218 -0.092300 0.088459 -0.097246 0.110303 0.226963 -0.292399 -0.257609 0.380200 -0.263310 -0.271518 0.407639 -0.019452 -0.220921 -0.208748 -0.214845 0.318504 -0.119879 -0.235614 0.304605 -0.197698 -0.286067 -0.137738 -0.111339 -0.171266 0.107735 0.093117 0.116190 0.093034 0.105088 0.102436 0.096700 0.088841 0.096492 0.101103 0.076167 0.096450 0.072907 0.109460 0.102597 0.130903 0.134937 0.140624 0.158949 0.146849 0.156766 0.155049 0.159820 0.158775 0.158755
qa: -0.4582 -0.2777 -0.4526 -0.3207 -0.0892 -0.0923 0.0885 -0.0972 0.1103 0.2270 -0.2924 -0.2576 0.3802 -0.2633 -0.2715 0.4076 -0.0195 -0.2209 -0.2087 -0.2148 0.3185 -0.1199 -0.2356 0.3046 -0.1977 -0.2861 -0.1377 -0.1113 -0.1713 0.1077 0.0931 0.1162 0.0930 0.1051 0.1024 0.0967 0.0888 0.0965 0.1011 0.0762 0.0965 0.0729 0.1095 0.1026 0.1309 0.1349 0.1406 0.1589 0.1468 0.1568 0.1550 0.1598 0.1588 0.1588
va: 1.9488 2.1288 2.0409 2.0864 3.1112 3.8300 3.8041 3.8524 3.9217 3.7779 3.9059 3.8950 4.1060 3.9508 3.9609 3.7381 3.7026 4.0633 3.8717 4.0056 3.6848 3.9188 4.0150 3.6409 3.9454 3.9913 3.8803 3.8609 3.9061 1.0200 1.0305 0.9969 1.0177 0.9979 1.0001 1.0023 1.0048 1.0018 1.0027 1.0018 1.0100 1.0076 1.0051 1.0036 1.0253 1.0234 1.0086 0.9894 1.0072 0.9972 0.9999 0.9895 0.9894 0.9899
dispcorr: -0.030927491 hartree
energy: -1285.359344333076
dipole: -14.17154 14.35196 0.18042 16.80207 -16.21797 0.58409 -2.07277 1.85377 -0.21900
magnitude: 0.64937 au
magnitude: 1.65056 debye
