program: Orca
programVersion: 5.0.2
elementType: O O O O N C C C C C C C C C C C C C C C C C C C C C C C C H H H H H H H H H H H H H H H H H H H H H H H H H
charge: 0
multiplicity: 1
keywords: wb97x-d3
keywords: def2-TZVPP
keywords: def2/J RIJCOSX
keywords: DEFGRID2
keywords: scfconv7
keywords: smallprint printgap noloewdin
keywords: NOSOSCF
formula: C24H25NO4
InChI: InChI=1/C24H25NO4/c1-23(2)19(21-24(3,4)29-21)20(23)22(26)28-18(14-25)15-9-8-12-17(13-15)27-16-10-6-5-7-11-16/h5-13,18-21H,1-4H3
54 atoms
O  -4.642988 1.845499 -1.193879
O  -0.870611 -1.269253 1.025174
O  -1.134248 -0.440269 -1.028328
O  3.991033 -0.330578 -0.117618
N  -2.175233 -3.552514 -1.134927
C  -2.643885 1.853915 0.262163
C  -1.239565 2.31526 0.432288
C  -1.624572 0.914744 0.892837
C  -3.255242 1.549775 -1.069872
C  -4.235852 0.479305 -1.264785
C  -0.323786 2.522816 -0.748169
C  -0.966769 3.282767 1.560235
C  -1.198093 -0.281911 0.163628
C  -4.361326 -0.15957 -2.621106
C  -4.675045 -0.391473 -0.118534
C  -0.413764 -2.489278 0.48451
C  0.977885 -2.424658 -0.120364
C  -1.397899 -3.053016 -0.452192
C  1.814493 -1.354076 0.173288
C  1.435631 -3.485155 -0.889879
C  3.113103 -1.348593 -0.321593
C  2.736868 -3.465866 -1.371672
C  3.580735 -2.406232 -1.093405
C  3.693978 0.692798 0.747819
C  3.610431 0.468233 2.11561
C  3.542382 1.966017 0.221949
C  3.36018 1.539454 2.960776
C  3.304678 3.032018 1.079525
C  3.206574 2.821746 2.447725
H  -3.355812 2.240773 0.98442
H  -1.701926 0.778574 1.964838
H  -2.669894 1.845831 -1.938684
H  -0.520284 1.873576 -1.596766
H  -0.412302 3.553193 -1.097705
H  0.714546 2.366446 -0.450066
H  -1.625673 3.114277 2.413023
H  -1.114876 4.311218 1.224998
H  0.063407 3.191617 1.910735
H  -3.76282 -1.070977 -2.664921
H  -4.020629 0.503945 -3.416767
H  -5.397177 -0.435781 -2.829068
H  -5.715429 -0.696085 -0.251431
H  -4.594726 0.105521 0.847474
H  -4.075467 -1.302312 -0.0817
H  -0.385853 -3.171431 1.339649
H  1.466462 -0.532026 0.78416
H  0.794093 -4.327762 -1.116169
H  3.097789 -4.290105 -1.97271
H  4.594442 -2.390483 -1.473393
H  3.741224 -0.529322 2.517205
H  3.617146 2.121723 -0.847073
H  3.291023 1.369695 4.027505
H  3.190407 4.028282 0.672189
H  3.01712 3.653712 3.113196
elementType: O N C H
totalener: -1285.32635242 hartree
nucrepener: 2810.61547818 hartree
electener: -4095.94183060 hartree
oneelecener: -7335.52759180 hartree
twoeener: 3239.58576120 hartree
cpcmener: -0.03634331 hartree
kineticenergy: 1279.66916051 hartree
xcener: -124.710169915025 hartree
chargesum: -0.0000000
charge: -0.456196 -0.294916 -0.430373 -0.322559 -0.105468 -0.096362 0.101350 -0.064417 0.088093 0.225317 -0.279198 -0.258023 0.337622 -0.250950 -0.280959 0.506816 -0.039379 -0.240877 -0.260592 -0.251635 0.353315 -0.093203 -0.259044 0.272201 -0.196727 -0.213341 -0.128903 -0.155898 -0.169985 0.108114 0.092780 0.118926 0.097962 0.108303 0.077716 0.091191 0.098145 0.089081 0.083578 0.090841 0.099096 0.108479 0.098750 0.086837 0.152645 0.136655 0.136638 0.158283 0.144841 0.155651 0.149768 0.160165 0.159384 0.160464
qa: -0.4562 -0.2949 -0.4304 -0.3226 -0.1055 -0.0964 0.1014 -0.0644 0.0881 0.2253 -0.2792 -0.2580 0.3376 -0.2510 -0.2810 0.5068 -0.0394 -0.2409 -0.2606 -0.2516 0.3533 -0.0932 -0.2590 0.2722 -0.1967 -0.2133 -0.1289 -0.1559 -0.1700 0.1081 0.0928 0.1189 0.0980 0.1083 0.0777 0.0912 0.0981 0.0891 0.0836 0.0908 0.0991 0.1085 0.0987 0.0868 0.1526 0.1367 0.1366 0.1583 0.1448 0.1557 0.1498 0.1602 0.1594 0.1605
va: 1.9486 2.1218 2.0518 2.0948 3.0836 3.8495 3.7794 3.8543 3.9413 3.7749 3.8892 3.8956 4.0779 3.9439 3.9645 3.7760 3.8052 4.0656 3.9543 3.9974 3.6977 3.8997 4.0170 3.6683 3.9442 3.9510 3.8664 3.8383 3.8520 1.0180 1.0322 0.9981 1.0231 1.0000 1.0200 1.0061 1.0017 1.0058 1.0098 1.0079 1.0036 1.0036 1.0029 1.0089 0.9872 1.0223 1.0128 0.9894 1.0088 0.9972 1.0043 0.9887 0.9901 0.9895
dispcorr: -0.032069903 hartree
energy: -1285.358422321698
dipole: -11.79492 13.56936 1.77444 15.60888 -14.96248 0.64640 1.49895 0.84127 2.34022
magnitude: 3.00718 au
magnitude: 7.64363 debye
