program: Orca
programVersion: 5.0.2
elementType: O O O O N C C C C C C C C C C C C C C C C C C C C C C C C H H H H H H H H H H H H H H H H H H H H H H H H H
charge: 0
multiplicity: 1
keywords: wb97x-d3
keywords: def2-TZVPP
keywords: def2/J RIJCOSX
keywords: DEFGRID2
keywords: scfconv7
keywords: smallprint printgap noloewdin
keywords: NOSOSCF
formula: C24H25NO4
InChI: InChI=1/C24H25NO4/c1-23(2)19(21-24(3,4)29-21)20(23)22(26)28-18(14-25)15-9-8-12-17(13-15)27-16-10-6-5-7-11-16/h5-13,18-21H,1-4H3
54 atoms
O  -2.658414 3.22826 -1.034415
O  -1.861893 -1.910878 0.15963
O  -2.646575 -0.205564 1.372844
O  3.04101 -0.645016 -0.893308
N  -0.362622 -4.764357 0.894945
C  -3.62372 0.968528 -1.239366
C  -4.764655 0.079959 -0.885956
C  -3.357119 -0.492999 -0.899085
C  -3.138526 2.079206 -0.36002
C  -1.728345 2.466442 -0.278723
C  -5.528874 0.252809 0.403852
C  -5.642896 -0.387845 -2.024061
C  -2.621834 -0.811594 0.334973
C  -1.221722 3.120742 0.979443
C  -0.67223 1.740222 -1.069976
C  -0.994649 -2.25227 1.234432
C  0.229996 -1.368581 1.254338
C  -0.645874 -3.659611 1.027986
C  1.134773 -1.421392 0.203965
C  0.41597 -0.470714 2.296227
C  2.227541 -0.564286 0.190009
C  1.51389 0.3736 2.276233
C  2.42083 0.340349 1.229222
C  4.298308 -0.103939 -0.834014
C  4.600424 0.960775 -1.666867
C  5.259032 -0.640518 0.012191
C  5.883114 1.490309 -1.656097
C  6.533873 -0.09767 0.020185
C  6.850356 0.968055 -0.811304
H  -3.511255 1.190358 -2.295944
H  -3.121484 -1.144412 -1.732184
H  -3.761429 2.299359 0.505409
H  -6.010932 -0.68558 0.682363
H  -4.917644 0.56685 1.244341
H  -6.316041 0.995704 0.264048
H  -5.083792 -0.505933 -2.952998
H  -6.440612 0.333179 -2.209614
H  -6.1067 -1.347594 -1.791126
H  -2.017736 3.640918 1.511545
H  -0.437836 3.845661 0.75259
H  -0.800885 2.368044 1.646507
H  -1.070589 1.251336 -1.957386
H  -0.188899 0.982899 -0.452433
H  0.102785 2.43748 -1.393759
H  -1.517879 -2.175332 2.192756
H  1.003169 -2.120798 -0.613224
H  -0.2991 -0.418719 3.105748
H  1.663686 1.079863 3.081746
H  3.264251 1.017552 1.225481
H  3.838046 1.362196 -2.321613
H  5.011564 -1.477351 0.652905
H  6.123149 2.318775 -2.309115
H  7.285505 -0.514807 0.677119
H  7.848082 1.385387 -0.803906
totalener: -1285.30226560 hartree
nucrepener: 2735.81034070 hartree
electener: -4021.11260630 hartree
oneelecener: -7185.24871921 hartree
twoeener: 3164.13611292 hartree
kineticenergy: 1279.74880040 hartree
xcener: -124.714664100449 hartree
chargesum: 0.0000000
charge: -0.380176 -0.257139 -0.388320 -0.293487 -0.000307 -0.116275 0.091515 -0.090893 0.113010 0.218377 -0.281050 -0.237487 0.321763 -0.243206 -0.215121 0.340485 0.017224 -0.266776 -0.204118 -0.137089 0.222449 -0.150554 -0.134048 0.195499 -0.168692 -0.144011 -0.114456 -0.124070 -0.120716 0.099996 0.084803 0.087317 0.089938 0.099539 0.097495 0.074592 0.092894 0.092912 0.083087 0.087581 0.081201 0.093748 0.014715 0.096430 0.117980 0.117737 0.117469 0.134084 0.133776 0.127198 0.135985 0.128329 0.130032 0.128830
qa: -0.3802 -0.2571 -0.3883 -0.2935 -0.0003 -0.1163 0.0915 -0.0909 0.1130 0.2184 -0.2811 -0.2375 0.3218 -0.2432 -0.2151 0.3405 0.0172 -0.2668 -0.2041 -0.1371 0.2224 -0.1506 -0.1340 0.1955 -0.1687 -0.1440 -0.1145 -0.1241 -0.1207 0.1000 0.0848 0.0873 0.0899 0.0995 0.0975 0.0746 0.0929 0.0929 0.0831 0.0876 0.0812 0.0937 0.0147 0.0964 0.1180 0.1177 0.1175 0.1341 0.1338 0.1272 0.1360 0.1283 0.1300 0.1288
va: 2.0378 2.1374 2.0997 2.1038 3.1217 3.8289 3.7844 3.8558 4.0065 3.8485 3.9142 3.8996 4.1582 3.9358 3.9258 3.8300 3.6262 4.0310 4.0284 3.9312 3.8425 3.9594 3.8874 3.8490 4.0175 3.9711 3.9427 3.9436 3.9416 1.0210 1.0320 1.0012 1.0033 1.0203 0.9983 1.0076 1.0040 1.0044 1.0162 1.0063 1.0080 1.0110 1.0375 1.0113 1.0181 1.0323 1.0194 1.0001 1.0069 1.0106 1.0026 0.9994 0.9995 0.9994
dispcorr: -0.030923365 hartree
energy: -1285.333188968472
dipole: -14.72214 15.10289 0.38076 16.33015 -15.33321 0.99693 -3.07277 3.26912 0.19634
magnitude: 1.08508 au
magnitude: 2.75806 debye
