program: Orca
programVersion: 5.0.2
elementType: O O O O N C C C C C C C C C C C C C C C C C C C C C C C C H H H H H H H H H H H H H H H H H H H H H H H H H
charge: 0
multiplicity: 1
keywords: wb97x-d3
keywords: def2-TZVPP
keywords: def2/J RIJCOSX
keywords: DEFGRID2
keywords: scfconv7
keywords: smallprint printgap noloewdin
keywords: NOSOSCF
formula: C24H25NO4
InChI: InChI=1/C24H25NO4/c1-23(2)19(21-24(3,4)29-21)20(23)22(26)28-18(14-25)15-9-8-12-17(13-15)27-16-10-6-5-7-11-16/h5-13,18-21H,1-4H3
54 atoms
O  -1.174271 2.8572 -1.209888
O  -1.447384 -1.100046 0.322353
O  -3.53877 -1.87732 0.289108
O  3.63016 -0.643859 0.226203
N  -1.19121 -2.588953 -2.677052
C  -2.506205 1.669962 0.468688
C  -2.511322 1.277763 1.906695
C  -3.202295 0.384141 0.888177
C  -1.267278 1.720861 -0.37056
C  -1.278627 1.583943 -1.830498
C  -1.242797 0.863789 2.613961
C  -3.451963 2.032605 2.818621
C  -2.780693 -0.967737 0.479462
C  -0.028521 1.132177 -2.539234
C  -2.556685 1.299843 -2.575118
C  -0.967918 -2.372202 -0.078303
C  0.473408 -2.497829 0.345888
C  -1.103891 -2.4968 -1.535269
C  1.370355 -1.475856 0.05779
C  0.890938 -3.635013 1.017489
C  2.689703 -1.590942 0.470309
C  2.220497 -3.750229 1.401583
C  3.118556 -2.733664 1.139751
C  3.249775 0.652245 -0.000607
C  2.501201 1.355163 0.935352
C  3.673752 1.262344 -1.169762
C  2.16448 2.675427 0.681648
C  3.343424 2.5901 -1.403612
C  2.578914 3.29647 -0.488502
H  -3.207266 2.454433 0.201577
H  -4.284566 0.435494 0.905073
H  -0.337574 1.47351 0.139857
H  -0.524428 0.342985 1.988093
H  -0.749148 1.75169 3.01436
H  -1.474445 0.211796 3.457638
H  -2.97135 2.936688 3.196653
H  -3.740767 1.423491 3.67676
H  -4.364641 2.336435 2.305076
H  0.865438 1.343264 -1.952657
H  0.075731 1.651946 -3.49353
H  -0.065096 0.063783 -2.753038
H  -2.662173 0.227874 -2.747556
H  -2.543687 1.787052 -3.55158
H  -3.440903 1.645958 -2.042818
H  -1.560261 -3.171286 0.376832
H  1.040004 -0.600244 -0.485906
H  0.188927 -4.42758 1.242495
H  2.555344 -4.636198 1.923699
H  4.152926 -2.812165 1.4470
H  2.185523 0.875753 1.853707
H  4.25786 0.699772 -1.885971
H  1.572153 3.221906 1.40355
H  3.671486 3.066216 -2.317855
H  2.303504 4.323177 -0.684028
totalener: -1285.29918323 hartree
nucrepener: 2891.09853887 hartree
electener: -4176.39772209 hartree
oneelecener: -7495.56932246 hartree
twoeener: 3319.17160037 hartree
kineticenergy: 1279.75065470 hartree
xcener: -124.717770003782 hartree
chargesum: 0.0000000
charge: -0.391698 -0.269440 -0.343652 -0.295580 -0.014777 -0.094180 0.101283 -0.141408 0.241936 0.153575 -0.256033 -0.239624 0.344867 -0.195253 -0.251233 0.269790 0.073237 -0.244523 -0.139597 -0.156553 0.232804 -0.084937 -0.213033 0.211665 -0.146594 -0.141563 -0.152648 -0.135296 -0.082036 0.096073 0.087992 -0.004737 0.059906 0.093853 0.100418 0.089734 0.093034 0.076252 0.012677 0.098437 0.097046 0.091333 0.094922 0.085651 0.118905 0.046898 0.115191 0.128815 0.129954 0.140744 0.125918 0.129981 0.125971 0.125532
qa: -0.3917 -0.2694 -0.3437 -0.2956 -0.0148 -0.0942 0.1013 -0.1414 0.2419 0.1536 -0.2560 -0.2396 0.3449 -0.1953 -0.2512 0.2698 0.0732 -0.2445 -0.1396 -0.1566 0.2328 -0.0849 -0.2130 0.2117 -0.1466 -0.1416 -0.1526 -0.1353 -0.0820 0.0961 0.0880 -0.0047 0.0599 0.0939 0.1004 0.0897 0.0930 0.0763 0.0127 0.0984 0.0970 0.0913 0.0949 0.0857 0.1189 0.0469 0.1152 0.1288 0.1300 0.1407 0.1259 0.1300 0.1260 0.1255
va: 2.0161 2.1202 2.1666 2.1309 3.0762 3.7821 3.7871 3.9090 3.8521 3.8865 3.9311 3.9098 4.2073 3.9346 3.9576 3.8896 3.6690 3.9451 3.9220 3.9848 3.8722 3.9702 4.0325 3.8200 3.8571 3.9536 3.9096 3.9285 3.8989 1.0225 1.0298 0.9993 1.0041 1.0014 1.0070 1.0035 1.0037 1.0087 1.0223 1.0141 1.0203 1.0104 1.0067 1.0056 1.0342 1.0587 1.0094 0.9997 1.0130 0.9965 1.0117 1.0018 1.0010 1.0025
dispcorr: -0.035947709 hartree
energy: -1285.335130934697
dipole: -8.43833 9.09192 0.65358 15.83575 -15.37181 0.46394 4.83561 -3.27623 1.55937
magnitude: 1.75330 au
magnitude: 4.45653 debye
