program: Orca
programVersion: 5.0.2
elementType: O O O O N C C C C C C C C C C C C C C C C C C C C C C C C H H H H H H H H H H H H H H H H H H H H H H H H H
charge: 0
multiplicity: 1
keywords: wb97x-d3
keywords: def2-TZVPP
keywords: def2/J RIJCOSX
keywords: DEFGRID2
keywords: scfconv7
keywords: smallprint printgap noloewdin
keywords: NOSOSCF
formula: C24H25NO4
InChI: InChI=1/C24H25NO4/c1-23(2)19(21-24(3,4)29-21)20(23)22(26)28-18(14-25)15-9-8-12-17(13-15)27-16-10-6-5-7-11-16/h5-13,18-21H,1-4H3
54 atoms
O  -3.140812 3.29703 -0.617489
O  -1.096133 -1.576887 -0.060903
O  -2.552235 -0.416536 1.174897
O  3.557926 0.945881 0.389123
N  0.962161 -4.0831 0.618809
C  -3.369218 0.965247 -1.377612
C  -4.231699 -0.246289 -1.429537
C  -2.735608 -0.410869 -1.213262
C  -3.398413 1.953615 -0.253267
C  -2.198475 2.646428 0.222755
C  -5.223017 -0.55731 -0.334804
C  -4.71939 -0.676742 -2.794041
C  -2.165996 -0.77226 0.093572
C  -2.1519 3.138323 1.645224
C  -0.847182 2.37935 -0.38714
C  -0.384918 -1.903193 1.127223
C  0.538806 -0.78431 1.543872
C  0.363001 -3.125202 0.823606
C  1.631446 -0.471224 0.742473
C  0.269206 -0.053918 2.689446
C  2.474282 0.567111 1.111234
C  1.109628 0.994532 3.038377
C  2.208976 1.306285 2.260942
C  4.107504 0.09206 -0.531138
C  4.566601 -1.166043 -0.163387
C  4.241031 0.543059 -1.834176
C  5.154343 -1.978129 -1.119963
C  4.843727 -0.274661 -2.779325
C  5.295387 -1.537354 -2.428554
H  -3.150908 1.426676 -2.335574
H  -2.174402 -0.788198 -2.059883
H  -4.214675 1.833034 0.457731
H  -4.889927 -0.278203 0.660072
H  -6.160294 -0.034904 -0.534135
H  -5.441564 -1.626218 -0.319388
H  -4.907625 -1.7512 -2.821099
H  -3.999695 -0.445128 -3.579997
H  -5.652213 -0.167469 -3.041957
H  -1.668875 2.395982 2.280799
H  -3.150184 3.326898 2.039094
H  -1.58047 4.065578 1.716968
H  -0.269783 3.304191 -0.441191
H  -0.91088 1.96987 -1.394081
H  -0.280693 1.680828 0.229804
H  -1.079312 -2.130617 1.942009
H  1.824962 -1.043726 -0.156581
H  -0.593024 -0.290879 3.297542
H  0.907177 1.573259 3.929552
H  2.870421 2.117867 2.533886
H  4.463059 -1.510176 0.857856
H  3.881778 1.528753 -2.098926
H  5.505753 -2.96124 -0.837116
H  4.953046 0.077927 -3.796317
H  5.75759 -2.175251 -3.169471
totalener: -1285.30265370 hartree
nucrepener: 2768.27770555 hartree
electener: -4053.58035926 hartree
oneelecener: -7250.29627538 hartree
twoeener: 3196.71591613 hartree
kineticenergy: 1279.75318125 hartree
xcener: -124.716240884241 hartree
chargesum: 0.0000000
charge: -0.380659 -0.260171 -0.390399 -0.294259 -0.002786 -0.113386 0.090910 -0.099123 0.107221 0.224059 -0.281591 -0.236883 0.326099 -0.242656 -0.218119 0.346124 0.003346 -0.269129 -0.187528 -0.163612 0.246865 -0.096724 -0.200538 0.243597 -0.177603 -0.196561 -0.100305 -0.097912 -0.136913 0.102130 0.085869 0.086086 0.100161 0.097442 0.090056 0.092561 0.074660 0.092926 0.077506 0.083361 0.089263 0.101144 0.092372 0.019057 0.119574 0.128509 0.120233 0.131429 0.128159 0.134804 0.125640 0.130492 0.127136 0.128063
qa: -0.3807 -0.2602 -0.3904 -0.2943 -0.0028 -0.1134 0.0909 -0.0991 0.1072 0.2241 -0.2816 -0.2369 0.3261 -0.2427 -0.2181 0.3461 0.0033 -0.2691 -0.1875 -0.1636 0.2469 -0.0967 -0.2005 0.2436 -0.1776 -0.1966 -0.1003 -0.0979 -0.1369 0.1021 0.0859 0.0861 0.1002 0.0974 0.0901 0.0926 0.0747 0.0929 0.0775 0.0834 0.0893 0.1011 0.0924 0.0191 0.1196 0.1285 0.1202 0.1314 0.1282 0.1348 0.1256 0.1305 0.1271 0.1281
va: 2.0359 2.1376 2.0970 2.1204 3.1208 3.8273 3.7792 3.8501 4.0095 3.8462 3.9136 3.9001 4.1612 3.9370 3.9307 3.8273 3.6242 4.0314 3.9187 3.9313 3.8343 3.9161 4.0157 3.7930 3.9772 4.0454 3.9435 3.9324 3.9578 1.0207 1.0314 1.0016 1.0198 0.9982 1.0034 1.0044 1.0075 1.0040 1.0102 1.0161 1.0056 1.0107 1.0096 1.0329 1.0198 1.0194 1.0199 0.9984 1.0126 1.0034 1.0127 0.9995 0.9991 1.0000
dispcorr: -0.031174953 hartree
energy: -1285.333828657756
dipole: -19.14506 18.97970 -0.16536 9.69294 -9.41261 0.28033 -6.21088 6.06045 -0.15043
magnitude: 0.35855 au
magnitude: 0.91136 debye
