program: Orca
programVersion: 5.0.2
elementType: O O O N C C C C C C C C C C C C C C C C C C C C C C C C H H H H H H H H H H H H H H H H H H H H H H H H H
charge: 0
multiplicity: 1
keywords: wb97x-d3
keywords: def2-TZVPP
keywords: def2/J RIJCOSX
keywords: DEFGRID2
keywords: scfconv7
keywords: smallprint printgap noloewdin
keywords: NOSOSCF
formula: C24H25NO3
InChI: InChI=1/C24H25NO3/c1-16(2)13-20-22(24(20,3)4)23(26)28-21(15-25)17-9-8-12-19(14-17)27-18-10-6-5-7-11-18/h5-14,20-22H,1-4H3
53 atoms
O  -0.716936 0.991795 1.247305
O  -0.786812 2.171217 -0.651431
O  -1.867057 -3.463067 -1.049402
N  -2.831597 0.105654 3.61857
C  2.255357 1.364927 -0.805577
C  2.16242 2.740781 -0.246015
C  1.320922 1.637504 0.368887
C  1.704783 1.099767 -2.184517
C  3.453023 0.511678 -0.464163
C  3.2684 3.350451 0.537386
C  -0.137356 1.654995 0.224952
C  3.127182 4.052961 1.664138
C  1.806831 4.317505 2.319887
C  4.313134 4.633891 2.371564
C  -2.130399 0.888635 1.225207
C  -2.63601 -0.115918 0.214837
C  -2.502061 0.457089 2.574221
C  -1.966822 -1.321308 0.047595
C  -3.789026 0.1625 -0.504345
C  -2.460477 -2.243293 -0.864375
C  -4.281809 -0.78112 -1.39384
C  -3.618007 -1.982105 -1.585161
C  -0.494418 -3.543642 -1.083094
C  0.267114 -2.661529 -1.839219
C  0.104048 -4.578578 -0.380581
C  1.644402 -2.823796 -1.882057
C  1.482596 -4.732656 -0.438477
C  2.258295 -3.855937 -1.183945
H  1.592264 3.433242 -0.862022
H  1.668034 1.251625 1.320093
H  1.274535 0.099889 -2.256295
H  0.946575 1.817532 -2.48951
H  2.516337 1.160067 -2.912229
H  3.802276 0.6724 0.55544
H  3.206701 -0.546934 -0.567229
H  4.282992 0.725119 -1.140236
H  4.268498 3.22026 0.132258
H  1.748393 3.813518 3.28833
H  1.690686 5.384776 2.522304
H  0.954235 3.99876 1.723785
H  4.23336 5.721529 2.440065
H  4.374326 4.264183 3.398365
H  5.250352 4.394267 1.869908
H  -2.601113 1.862628 1.054028
H  -1.077232 -1.544603 0.624608
H  -4.299988 1.107255 -0.368967
H  -5.181641 -0.573748 -1.957004
H  -3.993941 -2.715011 -2.287324
H  -0.201812 -1.85918 -2.395621
H  -0.50292 -5.258753 0.203266
H  2.238743 -2.139216 -2.473352
H  1.949036 -5.540697 0.109488
H  3.332555 -3.976224 -1.224141
elementType: O N C H
totalener: -1210.09213436 hartree
nucrepener: 2550.62793653 hartree
electener: -3760.72007089 hartree
oneelecener: -6712.45081443 hartree
twoeener: 2951.73074354 hartree
cpcmener: -0.03569175 hartree
kineticenergy: 1204.69880861 hartree
xcener: -118.583140715891 hartree
chargesum: 0.0000000
charge: -0.292421 -0.474016 -0.342916 -0.101783 0.164268 -0.002527 -0.113198 -0.286341 -0.287218 -0.309240 0.394947 -0.011945 -0.240092 -0.228746 0.421473 0.008455 -0.222259 -0.159333 -0.204728 0.214688 -0.121920 -0.222210 0.264055 -0.163474 -0.241472 -0.180710 -0.126865 -0.177772 0.107674 0.098872 0.083613 0.097070 0.103207 0.095815 0.094261 0.101242 0.123914 0.102140 0.102683 0.084489 0.096954 0.094728 0.090277 0.146957 0.148578 0.149057 0.161962 0.151548 0.162880 0.148798 0.173609 0.161207 0.161763
qa: -0.2924 -0.4740 -0.3429 -0.1018 0.1643 -0.0025 -0.1132 -0.2863 -0.2872 -0.3092 0.3949 -0.0119 -0.2401 -0.2287 0.4215 0.0085 -0.2223 -0.1593 -0.2047 0.2147 -0.1219 -0.2222 0.2641 -0.1635 -0.2415 -0.1807 -0.1269 -0.1778 0.1077 0.0989 0.0836 0.0971 0.1032 0.0958 0.0943 0.1012 0.1239 0.1021 0.1027 0.0845 0.0970 0.0947 0.0903 0.1470 0.1486 0.1491 0.1620 0.1515 0.1629 0.1488 0.1736 0.1612 0.1618
va: 2.1039 2.0317 2.0590 3.1107 3.6576 3.8149 3.8337 3.8928 3.9140 3.8967 4.1204 3.7098 3.9325 3.9307 3.7053 3.6133 4.0884 3.9046 3.9765 3.7713 3.8985 4.0020 3.7069 3.8689 4.0052 3.8701 3.8862 3.8976 1.0209 1.0292 1.0056 1.0211 1.0011 1.0041 1.0060 0.9998 1.0039 0.9984 0.9995 1.0110 0.9964 0.9966 1.0061 1.0176 1.0172 1.0013 0.9881 1.0032 0.9939 1.0064 0.9788 0.9876 0.9902
dispcorr: -0.028491775 hartree
energy: -1210.120626135722
dipole: 29.45930 -27.89817 1.56113 17.96027 -17.41917 0.54110 -1.69981 0.61797 -1.08184
magnitude: 1.97491 au
magnitude: 5.01983 debye
