program: Orca
programVersion: 5.0.2
elementType: O O O N C C C C C C C C C C C C C C C C C C C C C C C C H H H H H H H H H H H H H H H H H H H H H H H H H
charge: 0
multiplicity: 1
keywords: wb97x-d3
keywords: def2-TZVPP
keywords: def2/J RIJCOSX
keywords: DEFGRID2
keywords: scfconv7
keywords: smallprint printgap noloewdin
keywords: NOSOSCF
formula: C24H25NO3
InChI: InChI=1/C24H25NO3/c1-16(2)13-20-22(24(20,3)4)23(26)28-21(15-25)17-9-8-12-19(14-17)27-18-10-6-5-7-11-18/h5-14,20-22H,1-4H3
53 atoms
O  -0.964394 1.254041 -0.198325
O  -0.926821 3.263803 0.771386
O  -1.73062 -3.774766 -0.425696
N  -2.461162 1.001993 2.84581
C  1.64185 3.637035 -1.040172
C  2.058885 3.282421 0.343807
C  1.022168 2.424413 -0.355216
C  0.833568 4.889943 -1.26575
C  2.557902 3.303738 -2.192209
C  3.399931 2.718986 0.647308
C  -0.358323 2.40986 0.133528
C  3.643393 1.66139 1.425852
C  2.576223 0.86231 2.109939
C  5.042471 1.183888 1.670329
C  -2.301688 1.060958 0.232409
C  -2.770327 -0.263608 -0.313949
C  -2.371375 1.046542 1.699517
C  -1.998505 -1.399509 -0.096583
C  -3.962824 -0.337305 -1.016309
C  -2.424266 -2.612711 -0.614144
C  -4.387859 -1.565942 -1.505018
C  -3.621572 -2.702833 -1.315754
C  -0.358548 -3.745394 -0.324288
C  0.425194 -3.073642 -1.254192
C  0.221033 -4.465361 0.709113
C  1.806329 -3.124682 -1.134623
C  1.604738 -4.518062 0.808894
C  2.401714 -3.8438 -0.105669
H  1.643567 3.931439 1.111949
H  1.369767 1.467521 -0.727027
H  0.150934 4.772502 -2.109258
H  0.251713 5.189243 -0.396869
H  1.507317 5.715247 -1.503169
H  3.296553 4.094345 -2.336535
H  3.096018 2.368218 -2.040253
H  1.987589 3.211662 -3.11799
H  4.24582 3.238468 0.204481
H  1.586534 1.309009 2.045222
H  2.518964 -0.145557 1.688999
H  2.815368 0.73878 3.168761
H  5.288297 1.225648 2.734444
H  5.156559 0.139342 1.368979
H  5.781011 1.774805 1.129138
H  -2.953207 1.865935 -0.121373
H  -1.078166 -1.33454 0.47182
H  -4.554218 0.55366 -1.182269
H  -5.317624 -1.635275 -2.053214
H  -3.946022 -3.657899 -1.708451
H  -0.029269 -2.520177 -2.066467
H  -0.404857 -4.984648 1.423716
H  2.419306 -2.602891 -1.857871
H  2.057604 -5.08455 1.611959
H  3.479501 -3.882966 -0.022426
elementType: O N C H
totalener: -1210.09278208 hartree
nucrepener: 2518.92043290 hartree
electener: -3729.01321498 hartree
oneelecener: -6649.19199500 hartree
twoeener: 2920.17878002 hartree
cpcmener: -0.03755662 hartree
kineticenergy: 1204.69906015 hartree
xcener: -118.582260062670 hartree
chargesum: -0.0000000
charge: -0.284906 -0.475541 -0.338525 -0.104095 0.140370 0.007163 -0.119020 -0.283617 -0.281094 -0.307901 0.406777 -0.013074 -0.232714 -0.228991 0.438481 -0.003919 -0.231144 -0.190107 -0.200122 0.239792 -0.117082 -0.231370 0.271100 -0.182072 -0.242373 -0.149043 -0.125827 -0.186614 0.105970 0.100991 0.101452 0.091966 0.097404 0.100206 0.093268 0.099143 0.123675 0.082913 0.098859 0.103545 0.097284 0.094382 0.090188 0.132732 0.151727 0.150197 0.162064 0.150434 0.159981 0.149694 0.163412 0.161834 0.162150
qa: -0.2849 -0.4755 -0.3385 -0.1041 0.1404 0.0072 -0.1190 -0.2836 -0.2811 -0.3079 0.4068 -0.0131 -0.2327 -0.2290 0.4385 -0.0039 -0.2311 -0.1901 -0.2001 0.2398 -0.1171 -0.2314 0.2711 -0.1821 -0.2424 -0.1490 -0.1258 -0.1866 0.1060 0.1010 0.1015 0.0920 0.0974 0.1002 0.0933 0.0991 0.1237 0.0829 0.0989 0.1035 0.0973 0.0944 0.0902 0.1327 0.1517 0.1502 0.1621 0.1504 0.1600 0.1497 0.1634 0.1618 0.1622
va: 2.1493 2.0244 2.0654 3.1073 3.7070 3.7942 3.8584 3.8991 3.9065 3.8954 4.1112 3.7149 3.9346 3.9307 3.7288 3.7374 4.0254 3.9295 3.9440 3.7815 3.9010 4.0027 3.6856 3.9126 4.0085 3.8775 3.8758 3.8917 1.0226 1.0228 0.9990 1.0169 1.0004 1.0004 1.0031 1.0028 1.0043 1.0100 0.9983 1.0002 0.9963 0.9970 1.0061 1.0189 1.0139 1.0017 0.9884 1.0045 0.9953 1.0062 0.9890 0.9879 0.9893
dispcorr: -0.026168739 hartree
energy: -1210.118950823329
dipole: 28.77463 -27.58484 1.18979 14.55831 -15.05136 -0.49305 -4.30354 1.81787 -2.48566
magnitude: 2.79950 au
magnitude: 7.11577 debye
