program: Orca
programVersion: 5.0.2
elementType: O O O N C C C C C C C C C C C C C C C C C C C C C C C C H H H H H H H H H H H H H H H H H H H H H H H H H
charge: 0
multiplicity: 1
keywords: wb97x-d3
keywords: def2-TZVPP
keywords: def2/J RIJCOSX
keywords: DEFGRID2
keywords: scfconv7
keywords: smallprint printgap noloewdin
keywords: NOSOSCF
formula: C24H25NO3
InChI: InChI=1/C24H25NO3/c1-16(2)13-20-22(24(20,3)4)23(26)28-21(15-25)17-9-8-12-19(14-17)27-18-10-6-5-7-11-18/h5-14,20-22H,1-4H3
53 atoms
O  -0.922807 1.303115 -0.344007
O  -0.907395 3.246023 0.752962
O  -1.511632 -3.686366 -1.116168
N  -2.081732 0.757622 2.798295
C  1.568276 3.865537 -1.116021
C  2.048032 3.390538 0.209072
C  1.00436 2.574234 -0.535278
C  0.722742 5.112481 -1.188483
C  2.451458 3.673685 -2.324731
C  3.410546 2.833833 0.412063
C  -0.344121 2.463965 0.024823
C  3.702364 1.747776 1.132683
C  2.675461 0.912595 1.834528
C  5.115076 1.273352 1.286402
C  -2.201225 1.016146 0.19406
C  -2.689475 -0.293891 -0.374547
C  -2.11921 0.896427 1.65663
C  -1.817973 -1.372448 -0.480479
C  -4.022965 -0.418101 -0.732065
C  -2.302384 -2.58628 -0.945948
C  -4.490109 -1.640076 -1.198186
C  -3.639521 -2.726063 -1.303637
C  -0.345438 -3.811418 -0.394591
C  0.82621 -4.043198 -1.096519
C  -0.35215 -3.766464 0.993513
C  2.008745 -4.240829 -0.395699
C  0.838441 -3.950958 1.680275
C  2.020889 -4.188957 0.990777
H  1.64294 3.944652 1.053211
H  1.362479 1.668837 -1.010986
H  0.166756 5.308089 -0.274533
H  1.367263 5.97542 -1.365221
H  0.012294 5.060138 -2.015233
H  3.160173 4.499125 -2.41413
H  3.023114 2.746825 -2.281729
H  1.852044 3.652337 -3.236187
H  4.226667 3.380706 -0.052564
H  2.96329 0.752869 2.876277
H  1.679582 1.350787 1.831244
H  2.607715 -0.079712 1.380054
H  5.219474 0.24159 0.941268
H  5.820247 1.889648 0.729422
H  5.416211 1.27822 2.336907
H  -2.916582 1.811213 -0.036249
H  -0.777392 -1.263859 -0.201973
H  -4.69274 0.427487 -0.6458
H  -5.529405 -1.748233 -1.477314
H  -4.003834 -3.679618 -1.663746
H  0.812596 -4.076644 -2.178363
H  -1.273671 -3.591617 1.534791
H  2.924156 -4.429455 -0.940745
H  0.838067 -3.915105 2.761605
H  2.944958 -4.338785 1.532841
elementType: O N C H
totalener: -1210.09245539 hartree
nucrepener: 2509.14851554 hartree
electener: -3719.24097093 hartree
oneelecener: -6629.85569824 hartree
twoeener: 2910.61472731 hartree
cpcmener: -0.03625143 hartree
kineticenergy: 1204.69568768 hartree
xcener: -118.582185349838 hartree
chargesum: 0.0000000
charge: -0.289033 -0.474984 -0.335699 -0.108382 0.148906 -0.001687 -0.115896 -0.281787 -0.281377 -0.306502 0.403961 -0.012781 -0.231530 -0.229227 0.430515 -0.001811 -0.228885 -0.186316 -0.211741 0.254205 -0.116642 -0.234166 0.270984 -0.230321 -0.190850 -0.131757 -0.146292 -0.180793 0.106747 0.101021 0.091424 0.097008 0.101733 0.100119 0.093420 0.098833 0.124151 0.103051 0.079773 0.099873 0.094887 0.090148 0.097221 0.137410 0.146648 0.148266 0.161397 0.149708 0.149957 0.159704 0.161936 0.163353 0.162095
qa: -0.2890 -0.4750 -0.3357 -0.1084 0.1489 -0.0017 -0.1159 -0.2818 -0.2814 -0.3065 0.4040 -0.0128 -0.2315 -0.2292 0.4305 -0.0018 -0.2289 -0.1863 -0.2117 0.2542 -0.1166 -0.2342 0.2710 -0.2303 -0.1908 -0.1318 -0.1463 -0.1808 0.1067 0.1010 0.0914 0.0970 0.1017 0.1001 0.0934 0.0988 0.1242 0.1031 0.0798 0.0999 0.0949 0.0901 0.0972 0.1374 0.1466 0.1483 0.1614 0.1497 0.1500 0.1597 0.1619 0.1634 0.1621
va: 2.1414 2.0237 2.0718 3.1050 3.6983 3.8022 3.8505 3.8953 3.9086 3.8960 4.1135 3.7141 3.9380 3.9313 3.7223 3.7620 4.0159 3.9226 3.9639 3.7699 3.9031 3.9952 3.6808 4.0077 3.9263 3.8778 3.8755 3.8902 1.0234 1.0244 1.0169 1.0006 0.9990 1.0001 1.0024 1.0028 1.0038 1.0000 1.0111 0.9986 0.9966 1.0060 0.9962 1.0193 1.0190 1.0027 0.9884 1.0053 1.0055 0.9957 0.9881 0.9887 0.9892
dispcorr: -0.026003329 hartree
energy: -1210.118458713960
dipole: 27.29550 -26.38496 0.91055 15.71137 -16.11787 -0.40650 -2.94895 0.94326 -2.00569
magnitude: 2.23990 au
magnitude: 5.69336 debye
