program: Orca
programVersion: 5.0.2
elementType: O O O N C C C C C C C C C C C C C C C C C C C C C C C C H H H H H H H H H H H H H H H H H H H H H H H H H
charge: 0
multiplicity: 1
keywords: wb97x-d3
keywords: def2-TZVPP
keywords: def2/J RIJCOSX
keywords: DEFGRID2
keywords: scfconv7
keywords: smallprint printgap noloewdin
keywords: NOSOSCF
formula: C24H25NO3
InChI: InChI=1/C24H25NO3/c1-16(2)13-20-22(24(20,3)4)23(26)28-21(15-25)17-9-8-12-19(14-17)27-18-10-6-5-7-11-18/h5-14,20-22H,1-4H3
53 atoms
O  -0.890889 0.93714 1.379539
O  -0.743691 2.12627 -0.50669
O  -1.977418 -3.507782 -0.980572
N  -3.245167 0.121968 3.531488
C  2.247922 1.141256 -0.379575
C  2.183479 2.555677 0.105645
C  1.241878 1.519054 0.697809
C  1.784171 0.851632 -1.786562
C  3.364951 0.231468 0.072332
C  3.205493 3.157992 0.982845
C  -0.196933 1.585854 0.423022
C  3.704676 4.395347 0.890367
C  3.315012 5.404358 -0.146247
C  4.727506 4.880371 1.873641
C  -2.299164 0.877705 1.214517
C  -2.726387 -0.110107 0.152763
C  -2.814753 0.462888 2.520697
C  -2.107346 -1.351234 0.078455
C  -3.75726 0.221372 -0.714296
C  -2.527894 -2.256719 -0.88501
C  -4.179278 -0.704305 -1.657616
C  -3.563694 -1.942195 -1.754153
C  -0.610866 -3.637248 -0.878239
C  -0.117237 -4.639659 -0.057739
C  0.247075 -2.827181 -1.611327
C  1.255031 -4.835308 0.025318
C  1.616004 -3.02973 -1.513295
C  2.125801 -4.03013 -0.695358
H  1.703407 3.232631 -0.59282
H  1.490495 1.162319 1.690841
H  2.651813 0.790895 -2.445934
H  1.2626 -0.104995 -1.843057
H  1.12724 1.619241 -2.189345
H  3.644854 0.383597 1.113594
H  3.067564 -0.813274 -0.037486
H  4.254911 0.387961 -0.539967
H  3.571798 2.528627 1.788808
H  2.674301 5.008762 -0.931262
H  2.793422 6.246683 0.315085
H  4.20406 5.820743 -0.624995
H  4.956159 4.133909 2.633739
H  5.659667 5.147574 1.369515
H  4.382735 5.784969 2.381254
H  -2.718039 1.866122 0.997734
H  -1.313493 -1.615147 0.767146
H  -4.229353 1.19345 -0.651514
H  -4.982904 -0.454098 -2.336857
H  -3.882118 -2.661162 -2.497917
H  -0.799028 -5.262398 0.5072
H  -0.142437 -2.050532 -2.25814
H  1.641672 -5.617725 0.664892
H  2.286169 -2.401448 -2.085712
H  3.194388 -4.182486 -0.624419
elementType: O N C H
totalener: -1210.09379926 hartree
nucrepener: 2527.13738884 hartree
electener: -3737.23118810 hartree
oneelecener: -6665.51515286 hartree
twoeener: 2928.28396476 hartree
cpcmener: -0.03687015 hartree
kineticenergy: 1204.69336741 hartree
xcener: -118.582630839061 hartree
chargesum: -0.0000000
charge: -0.290333 -0.471922 -0.344912 -0.102000 0.122003 0.028853 -0.073944 -0.279427 -0.276378 -0.286126 0.391147 -0.046494 -0.254376 -0.219116 0.424470 0.007492 -0.225188 -0.155105 -0.201338 0.204508 -0.123164 -0.216851 0.252262 -0.233277 -0.152924 -0.130806 -0.192591 -0.169080 0.097209 0.091587 0.104057 0.083492 0.097926 0.091907 0.094105 0.099705 0.121516 0.091347 0.099713 0.094200 0.088949 0.094647 0.093622 0.147646 0.149267 0.150174 0.162453 0.151461 0.149167 0.164136 0.161522 0.172664 0.162144
qa: -0.2903 -0.4719 -0.3449 -0.1020 0.1220 0.0289 -0.0739 -0.2794 -0.2764 -0.2861 0.3911 -0.0465 -0.2544 -0.2191 0.4245 0.0075 -0.2252 -0.1551 -0.2013 0.2045 -0.1232 -0.2169 0.2523 -0.2333 -0.1529 -0.1308 -0.1926 -0.1691 0.0972 0.0916 0.1041 0.0835 0.0979 0.0919 0.0941 0.0997 0.1215 0.0913 0.0997 0.0942 0.0889 0.0946 0.0936 0.1476 0.1493 0.1502 0.1625 0.1515 0.1492 0.1641 0.1615 0.1727 0.1621
va: 2.1169 2.0348 2.0538 3.1105 3.6452 3.8051 3.8268 3.9023 3.9192 3.8884 4.1694 3.7570 3.9414 3.9197 3.6991 3.6068 4.0917 3.8993 3.9730 3.7752 3.8977 4.0014 3.7109 4.0001 3.8607 3.8899 3.8746 3.8820 1.0281 1.0364 1.0003 1.0053 1.0213 1.0080 1.0031 1.0009 1.0108 1.0093 0.9958 0.9977 1.0088 0.9964 0.9957 1.0166 1.0175 1.0010 0.9879 1.0033 1.0060 0.9927 0.9875 0.9804 0.9895
dispcorr: -0.027529748 hartree
energy: -1210.121329007926
dipole: 33.73171 -31.94740 1.78432 19.52298 -18.99758 0.52539 -5.43488 4.17810 -1.25677
magnitude: 2.24484 au
magnitude: 5.70593 debye
