program: Orca
programVersion: 5.0.2
elementType: O O O N C C C C C C C C C C C C C C C C C C C C C C C C H H H H H H H H H H H H H H H H H H H H H H H H H
charge: 0
multiplicity: 1
keywords: wb97x-d3
keywords: def2-TZVPP
keywords: def2/J RIJCOSX
keywords: DEFGRID2
keywords: scfconv7
keywords: smallprint printgap noloewdin
keywords: NOSOSCF
formula: C24H25NO3
InChI: InChI=1/C24H25NO3/c1-16(2)13-20-22(24(20,3)4)23(26)28-21(15-25)17-9-8-12-19(14-17)27-18-10-6-5-7-11-18/h5-14,20-22H,1-4H3
53 atoms
O  -0.723717 1.484455 1.216109
O  -0.445739 2.55589 -0.725713
O  -0.241679 -3.341451 -0.372886
N  -3.283049 0.289135 2.920478
C  2.586578 2.328311 0.087091
C  2.103176 3.71811 0.360474
C  1.315781 2.53877 0.900788
C  2.517606 1.808595 -1.327887
C  3.766615 1.782965 0.853858
C  2.774716 4.620306 1.318039
C  -0.007244 2.225942 0.348871
C  3.154344 5.881564 1.087534
C  2.96997 6.608869 -0.208641
C  3.832206 6.682797 2.158301
C  -1.997928 1.036689 0.770153
C  -1.885948 -0.115686 -0.198994
C  -2.704113 0.622893 1.983993
C  -1.144037 -1.237385 0.154053
C  -2.515457 -0.046325 -1.432039
C  -1.02933 -2.285175 -0.744462
C  -2.396488 -1.107973 -2.318676
C  -1.651837 -2.227831 -1.987197
C  -0.635317 -4.617782 -0.702026
C  0.330851 -5.476667 -1.202729
C  -1.937344 -5.053627 -0.490263
C  -0.01148 -6.790787 -1.491676
C  -2.267328 -6.366435 -0.79356
C  -1.309917 -7.239415 -1.294502
H  1.644466 4.198154 -0.497402
H  1.419501 2.336897 1.960963
H  3.473199 1.989815 -1.823233
H  2.340021 0.731696 -1.344335
H  1.748778 2.288209 -1.928809
H  3.758146 0.69185 0.836654
H  4.700763 2.113528 0.395755
H  3.777974 2.095369 1.896892
H  2.97676 4.205907 2.301554
H  2.398479 7.52761 -0.056236
H  3.9386 6.914474 -0.612409
H  2.465071 6.025108 -0.97529
H  4.826868 7.002553 1.83711
H  3.272614 7.59547 2.378693
H  3.942288 6.122483 3.086422
H  -2.574029 1.852808 0.322995
H  -0.655866 -1.304878 1.119487
H  -3.091204 0.829532 -1.701404
H  -2.877329 -1.057964 -3.286195
H  -1.554656 -3.041911 -2.694011
H  1.341006 -5.121294 -1.361253
H  -2.687401 -4.383376 -0.089347
H  0.742351 -7.461936 -1.881589
H  -3.280561 -6.708789 -0.629064
H  -1.574459 -8.262232 -1.526878
elementType: O N C H
totalener: -1210.09406814 hartree
nucrepener: 2412.94690221 hartree
electener: -3623.04097035 hartree
oneelecener: -6437.56387944 hartree
twoeener: 2814.52290910 hartree
cpcmener: -0.03583604 hartree
kineticenergy: 1204.69004412 hartree
xcener: -118.580537330084 hartree
chargesum: 0.0000000
charge: -0.289578 -0.473599 -0.341251 -0.103227 0.108223 0.046257 -0.102857 -0.276695 -0.267727 -0.288698 0.401708 -0.046268 -0.250104 -0.218892 0.438681 0.002614 -0.225533 -0.236496 -0.191156 0.226028 -0.135343 -0.164322 0.249419 -0.231712 -0.165121 -0.135552 -0.158236 -0.176558 0.095291 0.092712 0.098575 0.099989 0.092953 0.098774 0.098663 0.089450 0.124173 0.095800 0.096845 0.089726 0.093602 0.093689 0.089081 0.143032 0.138434 0.151500 0.163984 0.162026 0.150050 0.161192 0.161531 0.163166 0.161759
qa: -0.2896 -0.4736 -0.3413 -0.1032 0.1082 0.0463 -0.1029 -0.2767 -0.2677 -0.2887 0.4017 -0.0463 -0.2501 -0.2189 0.4387 0.0026 -0.2255 -0.2365 -0.1912 0.2260 -0.1353 -0.1643 0.2494 -0.2317 -0.1651 -0.1356 -0.1582 -0.1766 0.0953 0.0927 0.0986 0.1000 0.0930 0.0988 0.0987 0.0894 0.1242 0.0958 0.0968 0.0897 0.0936 0.0937 0.0891 0.1430 0.1384 0.1515 0.1640 0.1620 0.1500 0.1612 0.1615 0.1632 0.1618
va: 2.1248 2.0353 2.0515 3.1099 3.6921 3.7788 3.8658 3.9036 3.9080 3.8720 4.1587 3.7559 3.9414 3.9203 3.6942 3.6152 4.0885 4.0666 3.9600 3.7885 3.9006 3.9024 3.7017 3.9957 3.8899 3.8873 3.8906 3.8875 1.0293 1.0365 1.0003 0.9993 1.0174 1.0020 1.0017 1.0055 1.0087 0.9970 0.9970 1.0100 0.9963 0.9963 1.0086 1.0151 1.0266 1.0025 0.9895 0.9931 1.0059 0.9948 0.9882 0.9892 0.9890
dispcorr: -0.024482202 hartree
energy: -1210.118550342707
dipole: 28.01698 -26.84291 1.17407 24.87926 -24.84244 0.03683 -3.26305 1.84213 -1.42092
magnitude: 1.84359 au
magnitude: 4.68603 debye
