program: Orca
programVersion: 5.0.2
elementType: O O O N C C C C C C C C C C C C C C C C C C C C C C C C H H H H H H H H H H H H H H H H H H H H H H H H H
charge: 0
multiplicity: 1
keywords: wb97x-d3
keywords: def2-TZVPP
keywords: def2/J RIJCOSX
keywords: DEFGRID2
keywords: scfconv7
keywords: smallprint printgap noloewdin
keywords: NOSOSCF
formula: C24H25NO3
InChI: InChI=1/C24H25NO3/c1-16(2)13-20-22(24(20,3)4)23(26)28-21(15-25)17-9-8-12-19(14-17)27-18-10-6-5-7-11-18/h5-14,20-22H,1-4H3
53 atoms
O  -1.448906 2.261905 0.013226
O  -1.418674 1.963194 -2.196726
O  -0.649696 -2.625791 1.023885
N  -3.684223 2.244323 2.433349
C  1.380481 3.450162 -0.260991
C  1.430814 2.001944 0.109151
C  0.624229 2.444013 -1.111021
C  0.657547 4.407051 0.655667
C  2.56661 4.087294 -0.946067
C  2.59973 1.127172 -0.089834
C  -0.824434 2.220298 -1.176625
C  3.006655 0.157626 0.737899
C  2.348662 -0.201527 2.035303
C  4.199525 -0.684798 0.40006
C  -2.742227 1.676366 0.06321
C  -2.668498 0.177558 -0.125542
C  -3.256488 2.000599 1.393868
C  -1.685434 -0.546302 0.542622
C  -3.547495 -0.459491 -0.987175
C  -1.595737 -1.909647 0.330356
C  -3.447983 -1.831155 -1.18129
C  -2.46731 -2.562406 -0.531306
C  0.459109 -3.076286 0.355818
C  0.887544 -2.54716 -0.855575
C  1.176611 -4.091751 0.978032
C  2.038212 -3.056667 -1.44556
C  2.325154 -4.583062 0.378645
C  2.760127 -4.073796 -0.838948
H  0.8166 1.758372 0.968089
H  1.08586 2.247829 -2.072343
H  -0.097363 3.92798 1.274445
H  1.378498 4.87223 1.330455
H  0.177602 5.206806 0.088914
H  2.257071 4.985519 -1.483063
H  3.315222 4.38426 -0.209473
H  3.048756 3.426056 -1.664719
H  3.163139 1.277934 -1.005986
H  1.877107 -1.185331 1.966089
H  3.094951 -0.276021 2.829688
H  1.59127 0.507384 2.363442
H  3.940837 -1.746685 0.413121
H  4.607829 -0.448946 -0.582278
H  4.993552 -0.552181 1.139597
H  -3.420641 2.122195 -0.671212
H  -0.989259 -0.062546 1.218621
H  -4.303921 0.111727 -1.509839
H  -4.1325 -2.331189 -1.852915
H  -2.381886 -3.630619 -0.685754
H  0.345663 -1.74698 -1.343043
H  0.83414 -4.491088 1.924367
H  2.371249 -2.64345 -2.388703
H  2.879454 -5.3742 0.866457
H  3.655214 -4.462077 -1.305885
elementType: O N C H
totalener: -1210.09014858 hartree
nucrepener: 2624.70228637 hartree
electener: -3834.79243495 hartree
oneelecener: -6860.51149327 hartree
twoeener: 3025.71905831 hartree
cpcmener: -0.03697056 hartree
kineticenergy: 1204.69630908 hartree
xcener: -118.584931313939 hartree
chargesum: -0.0000000
charge: -0.286062 -0.465866 -0.340195 -0.099533 0.095647 0.067353 -0.071925 -0.265970 -0.278176 -0.280488 0.380705 -0.065316 -0.277962 -0.222069 0.398236 -0.013013 -0.225926 -0.183593 -0.165571 0.166375 -0.138140 -0.138292 0.246518 -0.136305 -0.222848 -0.208822 -0.122838 -0.173994 0.100998 0.091107 0.090880 0.095511 0.100195 0.099606 0.099004 0.090976 0.121207 0.096880 0.109823 0.098781 0.075521 0.096134 0.108836 0.146251 0.155707 0.151078 0.164497 0.159610 0.150617 0.145506 0.160366 0.159867 0.159114
qa: -0.2861 -0.4659 -0.3402 -0.0995 0.0956 0.0674 -0.0719 -0.2660 -0.2782 -0.2805 0.3807 -0.0653 -0.2780 -0.2221 0.3982 -0.0130 -0.2259 -0.1836 -0.1656 0.1664 -0.1381 -0.1383 0.2465 -0.1363 -0.2228 -0.2088 -0.1228 -0.1740 0.1010 0.0911 0.0909 0.0955 0.1002 0.0996 0.0990 0.0910 0.1212 0.0969 0.1098 0.0988 0.0755 0.0961 0.1088 0.1463 0.1557 0.1511 0.1645 0.1596 0.1506 0.1455 0.1604 0.1599 0.1591
va: 2.1095 2.0336 2.0296 3.1059 3.7475 3.7087 3.8265 3.9035 3.9166 3.8397 4.1704 3.7532 3.9382 3.9108 3.7484 3.6161 4.0775 4.0013 3.9463 3.8530 3.8907 3.9541 3.6181 3.7565 3.9564 3.8836 3.8736 3.8402 1.0177 1.0311 1.0111 0.9997 1.0007 1.0012 1.0011 1.0062 1.0121 0.9917 0.9995 1.0069 0.9994 1.0086 0.9994 1.0136 1.0041 0.9998 0.9880 0.9948 1.0060 1.0085 0.9916 0.9876 0.9902
dispcorr: -0.031642418 hartree
energy: -1210.121791000137
dipole: 28.34720 -26.93617 1.41103 6.02571 -6.53194 -0.50623 -0.13903 -0.89597 -1.03500
magnitude: 1.82168 au
magnitude: 4.63034 debye
