program: Orca
programVersion: 5.0.2
elementType: O O O N C C C C C C C C C C C C C C C C C C C C C C C C H H H H H H H H H H H H H H H H H H H H H H H H H
charge: 0
multiplicity: 1
keywords: wb97x-d3
keywords: def2-TZVPP
keywords: def2/J RIJCOSX
keywords: DEFGRID2
keywords: scfconv7
keywords: smallprint printgap noloewdin
keywords: NOSOSCF
formula: C24H25NO3
InChI: InChI=1/C24H25NO3/c1-16(2)13-20-22(24(20,3)4)23(26)28-21(15-25)17-9-8-12-19(14-17)27-18-10-6-5-7-11-18/h5-14,20-22H,1-4H3
53 atoms
O  -1.085222 1.667019 1.329039
O  -0.601637 2.418906 -0.719278
O  -0.074641 -2.920805 -0.407737
N  -3.698929 0.483214 2.950027
C  2.303505 1.845789 0.475321
C  2.07822 3.310735 0.245689
C  1.04865 2.516213 1.019233
C  2.210558 0.915267 -0.709395
C  3.301055 1.382396 1.508053
C  2.842752 4.359121 0.94846
C  -0.261173 2.228064 0.421896
C  3.318327 5.49017 0.416717
C  3.162675 5.89906 -1.015905
C  4.069306 6.474596 1.2623
C  -2.329754 1.191734 0.839232
C  -2.179136 0.005132 -0.087268
C  -3.084338 0.802646 2.031797
C  -1.226991 -0.968294 0.186181
C  -3.002779 -0.105373 -1.197215
C  -1.085961 -2.041068 -0.680197
C  -2.862773 -1.197037 -2.042787
C  -1.901966 -2.165384 -1.799095
C  -0.248644 -4.262839 -0.648163
C  0.814476 -4.947857 -1.216974
C  -1.411823 -4.928282 -0.281882
C  0.71281 -6.317861 -1.415861
C  -1.503213 -6.295834 -0.497322
C  -0.445666 -6.996006 -1.063337
H  1.777094 3.549779 -0.768405
H  1.036006 2.643194 2.096223
H  1.571659 1.293385 -1.504931
H  3.204771 0.770361 -1.135813
H  1.836024 -0.066604 -0.411239
H  3.319831 2.010965 2.397022
H  3.067269 0.366071 1.82984
H  4.307502 1.370499 1.085302
H  3.021106 4.188735 2.006142
H  2.678856 5.151561 -1.640854
H  2.580516 6.821343 -1.090219
H  4.13782 6.117736 -1.45773
H  5.076866 6.637939 0.871447
H  3.576486 7.450324 1.258263
H  4.157926 6.146372 2.297635
H  -2.892951 1.987727 0.341029
H  -0.583325 -0.898502 1.054925
H  -3.740825 0.657895 -1.407378
H  -3.49504 -1.286351 -2.915803
H  -1.78742 -2.997636 -2.481455
H  1.714625 -4.414842 -1.495636
H  -2.236858 -4.393907 0.172162
H  1.543432 -6.853081 -1.856792
H  -2.408078 -6.816174 -0.212004
H  -0.523747 -8.06269 -1.224983
elementType: O N C H
totalener: -1210.09345871 hartree
nucrepener: 2449.03678276 hartree
electener: -3659.13024146 hartree
oneelecener: -6509.68691803 hartree
twoeener: 2850.55667657 hartree
cpcmener: -0.03670400 hartree
kineticenergy: 1204.69136963 hartree
xcener: -118.582038942978 hartree
chargesum: 0.0000000
charge: -0.285670 -0.461252 -0.342591 -0.102238 0.112276 0.032893 -0.076302 -0.275925 -0.274155 -0.286056 0.373352 -0.050731 -0.253913 -0.217583 0.427185 0.030767 -0.223661 -0.282445 -0.203257 0.278934 -0.127770 -0.181849 0.260393 -0.240262 -0.175806 -0.134480 -0.157301 -0.177721 0.094186 0.096130 0.094324 0.104811 0.092424 0.090838 0.098400 0.099347 0.122578 0.091169 0.098296 0.095400 0.093855 0.093308 0.088859 0.147691 0.142027 0.149778 0.163928 0.161980 0.150192 0.159927 0.160894 0.163027 0.161803
qa: -0.2857 -0.4613 -0.3426 -0.1022 0.1123 0.0329 -0.0763 -0.2759 -0.2742 -0.2861 0.3734 -0.0507 -0.2539 -0.2176 0.4272 0.0308 -0.2237 -0.2824 -0.2033 0.2789 -0.1278 -0.1818 0.2604 -0.2403 -0.1758 -0.1345 -0.1573 -0.1777 0.0942 0.0961 0.0943 0.1048 0.0924 0.0908 0.0984 0.0993 0.1226 0.0912 0.0983 0.0954 0.0939 0.0933 0.0889 0.1477 0.1420 0.1498 0.1639 0.1620 0.1502 0.1599 0.1609 0.1630 0.1618
va: 2.1149 2.0427 2.0358 3.1095 3.6902 3.8015 3.8009 3.9019 3.9068 3.8783 4.2102 3.7636 3.9400 3.9197 3.6895 3.5863 4.0886 4.0386 3.9906 3.7114 3.8968 3.9275 3.7034 3.9995 3.8965 3.8887 3.8915 3.8880 1.0300 1.0335 1.0149 1.0018 1.0040 1.0061 1.0017 1.0012 1.0099 1.0101 0.9960 0.9975 0.9965 0.9960 1.0087 1.0139 1.0254 1.0012 0.9890 0.9931 1.0058 0.9963 0.9887 0.9892 0.9889
dispcorr: -0.025588234 hartree
energy: -1210.119046939376
dipole: 28.78885 -27.62226 1.16660 19.99410 -20.15041 -0.15631 -3.95759 2.73454 -1.22305
magnitude: 1.69742 au
magnitude: 4.31450 debye
