program: Orca
programVersion: 5.0.2
elementType: O O O N C C C C C C C C C C C C C C C C C C C C C C C C H H H H H H H H H H H H H H H H H H H H H H H H H
charge: 0
multiplicity: 1
keywords: wb97x-d3
keywords: def2-TZVPP
keywords: def2/J RIJCOSX
keywords: DEFGRID2
keywords: scfconv7
keywords: smallprint printgap noloewdin
keywords: NOSOSCF
formula: C24H25NO3
InChI: InChI=1/C24H25NO3/c1-16(2)13-20-22(24(20,3)4)23(26)28-21(15-25)17-9-8-12-19(14-17)27-18-10-6-5-7-11-18/h5-14,20-22H,1-4H3
53 atoms
O  -1.331238 1.890744 1.123672
O  -0.707034 2.501066 -0.934556
O  -0.184004 -2.784894 -0.124809
N  -4.053776 0.842908 2.654351
C  2.089041 1.839441 0.449183
C  1.970784 3.302827 0.141968
C  0.852792 2.622777 0.884507
C  2.007853 0.850283 -0.686599
C  3.005848 1.395386 1.560309
C  2.784601 4.31811 0.856069
C  -0.436305 2.362739 0.232412
C  3.897479 4.88183 0.379704
C  4.488541 4.553498 -0.956534
C  4.651368 5.901496 1.177252
C  -2.544131 1.382723 0.590526
C  -2.331013 0.120964 -0.218024
C  -3.376608 1.089506 1.757933
C  -1.391907 -0.810268 0.203084
C  -3.07984 -0.10034 -1.363978
C  -1.180795 -1.953581 -0.55215
C  -2.870159 -1.259102 -2.097917
C  -1.917391 -2.187106 -1.707817
C  -0.263907 -4.135863 -0.365763
C  0.868548 -4.764512 -0.859707
C  -1.410927 -4.860306 -0.067959
C  0.852419 -6.139081 -1.054198
C  -1.416826 -6.231114 -0.279193
C  -0.289205 -6.875781 -0.771604
H  1.756342 3.519391 -0.900723
H  0.789037 2.806346 1.951948
H  3.013016 0.645101 -1.059569
H  1.582872 -0.099617 -0.355461
H  1.420096 1.208956 -1.529083
H  2.695069 0.424827 1.950443
H  4.026605 1.290104 1.187119
H  3.028186 2.097663 2.392555
H  2.442914 4.608536 1.845454
H  5.516555 4.200761 -0.842374
H  3.93502 3.788461 -1.498445
H  4.539213 5.444002 -1.588139
H  5.674711 5.568313 1.368255
H  4.731432 6.846242 0.633698
H  4.177673 6.103909 2.137706
H  -3.066344 2.134816 -0.009908
H  -0.807833 -0.65469 1.102301
H  -3.811205 0.62899 -1.687285
H  -3.442593 -1.435742 -2.998494
H  -1.749663 -3.071795 -2.307984
H  1.755225 -4.185123 -1.083684
H  -2.289786 -4.366528 0.327392
H  1.736848 -6.631313 -1.436578
H  -2.30967 -6.797648 -0.049882
H  -0.300689 -7.945564 -0.930668
elementType: O N C H
totalener: -1210.09207843 hartree
nucrepener: 2463.84634674 hartree
electener: -3673.93842517 hartree
oneelecener: -6539.27406628 hartree
twoeener: 2865.33564111 hartree
cpcmener: -0.03603262 hartree
kineticenergy: 1204.70577607 hartree
xcener: -118.583708556761 hartree
chargesum: 0.0000000
charge: -0.286093 -0.458181 -0.340066 -0.101731 0.154297 -0.007851 -0.111254 -0.297936 -0.271898 -0.272427 0.376271 -0.033094 -0.249581 -0.229797 0.425470 0.042487 -0.224468 -0.293003 -0.210543 0.291357 -0.127028 -0.191673 0.260014 -0.235913 -0.180603 -0.135135 -0.155665 -0.175208 0.101005 0.098407 0.105562 0.093911 0.097673 0.100655 0.098391 0.093844 0.124375 0.096658 0.087436 0.100058 0.094709 0.095250 0.089896 0.147334 0.143481 0.148217 0.163697 0.161192 0.150700 0.160687 0.161289 0.162702 0.162122
qa: -0.2861 -0.4582 -0.3401 -0.1017 0.1543 -0.0079 -0.1113 -0.2979 -0.2719 -0.2724 0.3763 -0.0331 -0.2496 -0.2298 0.4255 0.0425 -0.2245 -0.2930 -0.2105 0.2914 -0.1270 -0.1917 0.2600 -0.2359 -0.1806 -0.1351 -0.1557 -0.1752 0.1010 0.0984 0.1056 0.0939 0.0977 0.1007 0.0984 0.0938 0.1244 0.0967 0.0874 0.1001 0.0947 0.0953 0.0899 0.1473 0.1435 0.1482 0.1637 0.1612 0.1507 0.1607 0.1613 0.1627 0.1621
va: 2.1107 2.0465 2.0397 3.1095 3.6620 3.8110 3.8616 3.8958 3.9028 3.8691 4.2166 3.6998 3.9401 3.9263 3.6926 3.5740 4.0900 4.0307 3.9951 3.7027 3.8992 3.9262 3.7031 3.9966 3.9098 3.8859 3.8902 3.8869 1.0222 1.0356 1.0030 1.0042 1.0144 1.0031 1.0017 1.0017 1.0058 0.9976 1.0083 0.9981 0.9962 0.9953 1.0074 1.0141 1.0247 1.0018 0.9890 0.9941 1.0048 0.9956 0.9887 0.9892 0.9888
dispcorr: -0.026575030 hartree
energy: -1210.118653461152
dipole: 32.66075 -31.16878 1.49197 15.32397 -15.83037 -0.50640 -3.26870 2.08498 -1.18372
magnitude: 1.97069 au
magnitude: 5.00909 debye
