program: Orca
programVersion: 5.0.2
elementType: O O O N C C C C C C C C C C C C C C C C C C C C C C C C H H H H H H H H H H H H H H H H H H H H H H H H H
charge: 0
multiplicity: 1
keywords: wb97x-d3
keywords: def2-TZVPP
keywords: def2/J RIJCOSX
keywords: DEFGRID2
keywords: scfconv7
keywords: smallprint printgap noloewdin
keywords: NOSOSCF
formula: C24H25NO3
InChI: InChI=1/C24H25NO3/c1-16(2)13-20-22(24(20,3)4)23(26)28-21(15-25)17-9-8-12-19(14-17)27-18-10-6-5-7-11-18/h5-14,20-22H,1-4H3
53 atoms
O  -1.165572 1.745525 1.289851
O  -0.689162 2.394141 -0.795743
O  -0.10155 -2.898303 -0.144139
N  -3.790634 0.685695 2.97916
C  2.212039 1.792961 0.377945
C  2.0288 3.257528 0.108473
C  0.985938 2.51889 0.917247
C  2.077559 0.831496 -0.777745
C  3.209438 1.330507 1.411205
C  2.839106 4.295072 0.77632
C  -0.338758 2.243402 0.348396
C  3.3978 5.364143 0.199832
C  3.295239 5.708223 -1.254865
C  4.193091 6.341091 1.012693
C  -2.412327 1.246797 0.830477
C  -2.256611 0.000101 -0.013306
C  -3.170648 0.941286 2.044514
C  -1.287936 -0.937118 0.318135
C  -3.082929 -0.194892 -1.110173
C  -1.126741 -2.060292 -0.479992
C  -2.923004 -1.334236 -1.88539
C  -1.942158 -2.267373 -1.58692
C  -0.172025 -4.230086 -0.483695
C  -1.245648 -5.015085 -0.084207
C  0.891021 -4.776445 -1.184685
C  -1.248797 -6.36531 -0.401024
C  0.879966 -6.132103 -1.485917
C  -0.18922 -6.928636 -1.101474
H  1.723877 3.479422 -0.908499
H  0.992435 2.679177 1.989859
H  1.680895 -0.130955 -0.446734
H  1.439452 1.203812 -1.576572
H  3.062096 0.647186 -1.211418
H  4.208591 1.274275 0.974892
H  3.260825 1.985523 2.279493
H  2.94924 0.332301 1.767593
H  2.985016 4.167702 1.844994
H  2.725858 6.632201 -1.389579
H  4.287357 5.895958 -1.672935
H  2.823032 4.936276 -1.859629
H  3.784377 7.350862 0.92176
H  4.211894 6.079138 2.070354
H  5.22592 6.394731 0.65897
H  -2.970361 2.009177 0.277167
H  -0.643009 -0.80116 1.178034
H  -3.835588 0.540159 -1.364077
H  -3.555998 -1.490875 -2.748386
H  -1.814464 -3.135144 -2.220521
H  -2.068141 -4.581812 0.471286
H  1.720364 -4.149822 -1.487164
H  -2.083581 -6.980342 -0.091714
H  1.709872 -6.56199 -2.031083
H  -0.19716 -7.98291 -1.343398
elementType: O N C H
totalener: -1210.09320206 hartree
nucrepener: 2455.47463784 hartree
electener: -3665.56783990 hartree
oneelecener: -6522.56175223 hartree
twoeener: 2856.99391233 hartree
cpcmener: -0.03655650 hartree
kineticenergy: 1204.69291472 hartree
xcener: -118.582082815686 hartree
chargesum: 0.0000000
charge: -0.285478 -0.460572 -0.339682 -0.102433 0.113744 0.038608 -0.079965 -0.276721 -0.272539 -0.290960 0.369208 -0.044191 -0.255718 -0.218870 0.427489 0.038238 -0.224338 -0.291241 -0.210780 0.291144 -0.131071 -0.188651 0.239387 -0.170886 -0.220674 -0.157843 -0.141596 -0.168102 0.093395 0.095805 0.091166 0.095448 0.105340 0.099290 0.090612 0.098451 0.122381 0.099713 0.094572 0.091391 0.092844 0.088641 0.094531 0.146826 0.142213 0.148963 0.163968 0.159723 0.161468 0.151087 0.162669 0.161599 0.162394
qa: -0.2855 -0.4606 -0.3397 -0.1024 0.1137 0.0386 -0.0800 -0.2767 -0.2725 -0.2910 0.3692 -0.0442 -0.2557 -0.2189 0.4275 0.0382 -0.2243 -0.2912 -0.2108 0.2911 -0.1311 -0.1887 0.2394 -0.1709 -0.2207 -0.1578 -0.1416 -0.1681 0.0934 0.0958 0.0912 0.0954 0.1053 0.0993 0.0906 0.0985 0.1224 0.0997 0.0946 0.0914 0.0928 0.0886 0.0945 0.1468 0.1422 0.1490 0.1640 0.1597 0.1615 0.1511 0.1627 0.1616 0.1624
va: 2.1122 2.0429 2.0393 3.1097 3.6866 3.7998 3.8112 3.9018 3.9061 3.8799 4.2119 3.7532 3.9411 3.9209 3.6903 3.5868 4.0898 4.0359 3.9925 3.7068 3.9046 3.9162 3.7182 3.9161 3.9916 3.8918 3.8863 3.8813 1.0307 1.0344 1.0037 1.0150 1.0019 1.0013 1.0059 1.0020 1.0097 0.9957 0.9978 1.0093 0.9959 1.0089 0.9964 1.0144 1.0256 1.0016 0.9890 0.9957 0.9950 1.0039 0.9892 0.9887 0.9886
dispcorr: -0.025837590 hartree
energy: -1210.119039647363
dipole: 29.43699 -28.14490 1.29209 18.78371 -19.17604 -0.39233 -5.48452 4.16649 -1.31803
magnitude: 1.88697 au
magnitude: 4.79628 debye
