program: Orca
programVersion: 5.0.2
elementType: O O O N C C C C C C C C C C C C C C C C C C C C C C C C H H H H H H H H H H H H H H H H H H H H H H H H H
charge: 0
multiplicity: 1
keywords: wb97x-d3
keywords: def2-TZVPP
keywords: def2/J RIJCOSX
keywords: DEFGRID2
keywords: scfconv7
keywords: smallprint printgap noloewdin
keywords: NOSOSCF
formula: C24H25NO3
InChI: InChI=1/C24H25NO3/c1-16(2)13-20-22(24(20,3)4)23(26)28-21(15-25)17-9-8-12-19(14-17)27-18-10-6-5-7-11-18/h5-14,20-22H,1-4H3
53 atoms
O  -1.341683 1.914588 1.052158
O  -0.524585 2.106981 -1.019753
O  -0.971125 -3.051743 0.598559
N  -4.317214 1.615966 2.462666
C  2.112478 1.372903 0.591773
C  2.153716 2.795206 0.120508
C  0.935932 2.299481 0.873097
C  1.98796 0.275292 -0.436841
C  2.917735 0.956878 1.798526
C  3.006968 3.823939 0.74628
C  -0.339021 2.114233 0.171941
C  3.700817 4.751755 0.08082
C  3.698544 4.859318 -1.421392
C  4.52524 5.768215 0.809135
C  -2.590673 1.529202 0.503405
C  -2.565021 0.129805 -0.071199
C  -3.541312 1.594361 1.613991
C  -1.771114 -0.84761 0.51458
C  -3.338464 -0.162276 -1.184113
C  -1.752183 -2.121125 -0.03168
C  -3.325302 -1.448503 -1.7045
C  -2.535892 -2.435143 -1.136314
C  -0.283332 -3.974194 -0.153543
C  -0.243482 -5.276291 0.321279
C  0.392832 -3.616812 -1.313686
C  0.47887 -6.233725 -0.377162
C  1.100075 -4.587772 -2.007857
C  1.145175 -5.89731 -1.547172
H  1.998309 2.910078 -0.947514
H  0.84167 2.607044 1.908622
H  1.494736 0.593941 -1.352591
H  2.983499 -0.077561 -0.711869
H  1.438597 -0.578837 -0.033805
H  2.933634 1.712803 2.582166
H  2.506222 0.043899 2.232197
H  3.950745 0.750154 1.512155
H  3.055497 3.824619 1.830881
H  4.432208 5.588058 -1.764679
H  3.932594 3.910693 -1.905838
H  2.726881 5.18092 -1.801994
H  5.576064 5.702811 0.515097
H  4.201493 6.783389 0.564659
H  4.468187 5.647666 1.890807
H  -2.931951 2.239977 -0.256642
H  -1.159096 -0.634196 1.382584
H  -3.943801 0.608517 -1.643504
H  -3.931389 -1.685938 -2.56821
H  -2.534345 -3.433833 -1.553416
H  -0.770816 -5.537032 1.230078
H  0.37358 -2.596268 -1.675965
H  0.508807 -7.249983 -0.007002
H  1.62354 -4.313034 -2.914159
H  1.698884 -6.64817 -2.09453
elementType: O N C H
totalener: -1210.09212878 hartree
nucrepener: 2482.45796594 hartree
electener: -3692.55009472 hartree
oneelecener: -6576.25658514 hartree
twoeener: 2883.70649042 hartree
cpcmener: -0.03631851 hartree
kineticenergy: 1204.69536931 hartree
xcener: -118.582618923223 hartree
chargesum: 0.0000000
charge: -0.287717 -0.462497 -0.341854 -0.101938 0.119423 0.045716 -0.085309 -0.280050 -0.276590 -0.314402 0.372335 -0.008842 -0.283977 -0.223188 0.420546 0.024900 -0.223031 -0.253602 -0.203907 0.249986 -0.131413 -0.170519 0.292557 -0.247257 -0.184885 -0.127574 -0.165491 -0.181628 0.095571 0.094770 0.097572 0.104805 0.088940 0.091136 0.098589 0.099597 0.121656 0.095994 0.102607 0.104674 0.096089 0.098549 0.085537 0.146873 0.141082 0.148561 0.164122 0.160349 0.148327 0.159749 0.161022 0.162608 0.161428
qa: -0.2877 -0.4625 -0.3419 -0.1019 0.1194 0.0457 -0.0853 -0.2800 -0.2766 -0.3144 0.3723 -0.0088 -0.2840 -0.2232 0.4205 0.0249 -0.2230 -0.2536 -0.2039 0.2500 -0.1314 -0.1705 0.2926 -0.2473 -0.1849 -0.1276 -0.1655 -0.1816 0.0956 0.0948 0.0976 0.1048 0.0889 0.0911 0.0986 0.0996 0.1217 0.0960 0.1026 0.1047 0.0961 0.0985 0.0855 0.1469 0.1411 0.1486 0.1641 0.1603 0.1483 0.1597 0.1610 0.1626 0.1614
va: 2.1096 2.0385 2.0490 3.1107 3.6894 3.8008 3.8275 3.9033 3.9095 3.9062 4.2037 3.6928 3.9408 3.9207 3.6986 3.6130 4.0830 4.0094 3.9892 3.7682 3.8931 3.9073 3.6510 4.0112 3.8831 3.8833 3.9127 3.8952 1.0262 1.0350 1.0150 1.0021 1.0003 1.0059 1.0018 1.0012 1.0090 1.0040 0.9965 0.9957 0.9931 0.9927 1.0099 1.0155 1.0252 1.0014 0.9888 0.9934 1.0073 0.9947 0.9882 0.9898 0.9890
dispcorr: -0.026485023 hartree
energy: -1210.118613808391
dipole: 33.18973 -31.41282 1.77691 14.32295 -14.80717 -0.48422 -5.21727 3.84834 -1.36893
magnitude: 2.29475 au
magnitude: 5.83279 debye
