program: Orca
programVersion: 5.0.2
elementType: O O O N C C C C C C C C C C C C C C C C C C C C C C C C H H H H H H H H H H H H H H H H H H H H H H H H H
charge: 0
multiplicity: 1
keywords: wb97x-d3
keywords: def2-TZVPP
keywords: def2/J RIJCOSX
keywords: DEFGRID2
keywords: scfconv7
keywords: smallprint printgap noloewdin
keywords: NOSOSCF
formula: C24H25NO3
InChI: InChI=1/C24H25NO3/c1-16(2)13-20-22(24(20,3)4)23(26)28-21(15-25)17-9-8-12-19(14-17)27-18-10-6-5-7-11-18/h5-14,20-22H,1-4H3
53 atoms
O  -1.471797 2.014753 0.95574
O  -0.635772 2.155496 -1.113445
O  -1.00128 -2.954101 0.631391
N  -4.447073 1.700978 2.3607
C  1.955176 1.431718 0.596414
C  2.046887 2.823492 0.043662
C  0.802868 2.41289 0.789285
C  1.826247 0.275147 -0.363772
C  2.732553 1.084822 1.841669
C  2.929636 3.848099 0.651023
C  -0.464156 2.203448 0.07912
C  4.034723 4.355083 0.0974
C  4.566401 3.948857 -1.2421
C  4.845994 5.393548 0.811139
C  -2.709991 1.589255 0.412041
C  -2.654236 0.176645 -0.126677
C  -3.665089 1.661105 1.518545
C  -1.844841 -0.769814 0.487726
C  -3.415406 -0.158588 -1.235828
C  -1.796172 -2.05542 -0.027124
C  -3.372558 -1.456556 -1.724688
C  -2.565986 -2.412507 -1.128427
C  -0.27258 -3.868231 -0.090852
C  -0.189419 -5.154974 0.419951
C  0.401689 -3.517945 -1.254457
C  0.575011 -6.103649 -0.244537
C  1.152406 -4.480705 -1.914025
C  1.241893 -5.77445 -1.416469
H  1.930103 2.879956 -1.034294
H  0.693934 2.784239 1.802676
H  1.268871 -0.549292 0.086508
H  1.340301 0.54078 -1.300496
H  2.820323 -0.101516 -0.612023
H  2.29236 0.218753 2.338716
H  3.763505 0.831468 1.586391
H  2.760096 1.901912 2.561379
H  2.645964 4.204954 1.637101
H  3.976675 3.173289 -1.727256
H  4.615787 4.807227 -1.916926
H  5.589287 3.57568 -1.146573
H  4.417992 5.655644 1.778493
H  5.868702 5.045353 0.977038
H  4.924646 6.30771 0.217147
H  -3.063182 2.273407 -0.36679
H  -1.242824 -0.522662 1.353767
H  -4.034143 0.587962 -1.716985
H  -3.969081 -1.72744 -2.585241
H  -2.540043 -3.420775 -1.52108
H  -0.716514 -5.410086 1.330549
H  0.348668 -2.509501 -1.646281
H  0.639068 -7.107268 0.154799
H  1.675138 -4.211448 -2.822461
H  1.829983 -6.518441 -1.936706
elementType: O N C H
totalener: -1210.09280223 hartree
nucrepener: 2490.04818581 hartree
electener: -3700.14098804 hartree
oneelecener: -6591.39480447 hartree
twoeener: 2891.25381643 hartree
cpcmener: -0.03647716 hartree
kineticenergy: 1204.69596290 hartree
xcener: -118.582543523429 hartree
chargesum: 0.0000000
charge: -0.286437 -0.459301 -0.342635 -0.101527 0.163437 0.012653 -0.120246 -0.296266 -0.267388 -0.288874 0.378265 -0.029934 -0.251928 -0.226933 0.419604 0.026212 -0.223697 -0.259897 -0.202579 0.250509 -0.131311 -0.170193 0.299270 -0.250587 -0.187847 -0.127352 -0.165835 -0.182366 0.098297 0.096331 0.088142 0.099551 0.106259 0.099434 0.098261 0.092542 0.123852 0.089087 0.097966 0.096150 0.089688 0.094486 0.094776 0.147909 0.143942 0.148405 0.164092 0.160569 0.148280 0.159959 0.161062 0.162556 0.161586
qa: -0.2864 -0.4593 -0.3426 -0.1015 0.1634 0.0127 -0.1202 -0.2963 -0.2674 -0.2889 0.3783 -0.0299 -0.2519 -0.2269 0.4196 0.0262 -0.2237 -0.2599 -0.2026 0.2505 -0.1313 -0.1702 0.2993 -0.2506 -0.1878 -0.1274 -0.1658 -0.1824 0.0983 0.0963 0.0881 0.0996 0.1063 0.0994 0.0983 0.0925 0.1239 0.0891 0.0980 0.0961 0.0897 0.0945 0.0948 0.1479 0.1439 0.1484 0.1641 0.1606 0.1483 0.1600 0.1611 0.1626 0.1616
va: 2.1100 2.0439 2.0459 3.1109 3.6716 3.7992 3.8793 3.8972 3.9009 3.8791 4.2007 3.7104 3.9434 3.9240 3.6962 3.6075 4.0832 4.0060 3.9900 3.7679 3.8925 3.9092 3.6405 4.0147 3.8844 3.8836 3.9140 3.8955 1.0249 1.0374 1.0014 1.0140 1.0030 1.0034 1.0027 1.0026 1.0064 1.0082 0.9973 0.9974 1.0078 0.9963 0.9954 1.0147 1.0231 1.0014 0.9887 0.9932 1.0074 0.9943 0.9881 0.9898 0.9889
dispcorr: -0.027083197 hartree
energy: -1210.119885423241
dipole: 35.41913 -33.50778 1.91135 11.86012 -12.45183 -0.59171 -4.19824 2.90696 -1.29128
magnitude: 2.38134 au
magnitude: 6.05289 debye
